{"text_format":"3","workbook":"xlsx","n_sheets":3,"sheets":["Bank angles","reference","StdAtm"],"not_rendered":{"charts":6,"macros":1,"external_links":1,"defined_names":28},"read":"whole","date_system":"1900"}

{"sheet":"Bank angles","index":0,"n_rows":32,"n_cols":26,"rows_kept":32}
[{"$nulls":7},"Bank Angle Performance"]
[]
[{"$nulls":3},"Density Altitude",6000,"ft ",null,null,{"$f":"VLOOKUP(E3,StdAtm!A11:G142,7)","v":1.093788226237521},"tas multiplier"]
["Insert values in green ",null,null,"Min Sink spd",42,"mph","TAS",{"$f":"E4*I3","v":{"v":45.93910550197588,"d":"46"}},{"$f":"VLOOKUP(F4,reference!$A$2:$D$4,4,FALSE)","v":0.868976},{"$f":"F4 &\" conversion to knots\"","v":"mph conversion to knots"},{"$nulls":3},"Note on density altitude effects: Given indicated airspeeds remain valid at any density altitude"]
[{"$nulls":3},"Stall Spd",33,{"$f":"F4","v":"mph"},null,null,{"$f":"VLOOKUP(F4,reference!$A$2:$D$4,2,FALSE)","v":1.46667},{"$f":"$F$4 &\" conversion to f/s \"","v":"mph conversion to f/s "}]
[{"$nulls":3},"Min Sink Rate",186,"ft/min",null,null,{"$f":"VLOOKUP(F4,reference!$A$2:$D$4,3,FALSE)","v":{"v":0.6818166322349267,"d":"0.682"}},{"$f":" \" f/s conversion to \"& $F$4","v":" f/s conversion to mph"}]
[{"$nulls":3},"wingspan",51,"Feet",null,null,{"$f":"VLOOKUP(F7,reference!A9:B10,2,FALSE)","v":1}," ft conversion",{"$f":"VLOOKUP(F7,reference!A9:B10,2,FALSE)*E7","v":{"v":51,"d":"51.0"}},"wingspan ft"]
["Bank angle","G load ","Stall speed\n increase ","Vs",{"$f":"\"V min sink \"& $F$4","v":"V min sink mph"},"sink rate\n factor","min sink \nTAS","Min Sink Rate\n ft/min","% sink rate\n increase","ROT °/sec","time to \nturn 360°: sec","altitude\n loss 360°","altitude\n loss 180°","turn \nradius ft","Turn \nDiameter ft",null,"circle \ncircumference ","effective wing length","outer \ncircumference","inner \ncircumference","wingtip circumference\n D","Outer Tip Speed\n ft/s","Inner Tip Speed\n ft/s","speed D\n f/s",{"$f":"\"Speed delta \n\"&$F$4","v":"Speed delta \nmph"},"Speed Delta %"]
[0,{"v":1,"d":"1.00"},{"v":0,"d":"0.00%"},{"$f":"$E$5","v":{"v":33,"d":"33.0"}},{"$f":"$E$4","v":{"v":42,"d":"42.0"}},{"$f":"(1/COS(RADIANS(A9)))^1.5-1","v":{"v":0,"d":"0.00"}},{"$f":"E9*$I$3","v":{"v":45.93910550197588,"d":"45.9"}},{"$f":"$E$6","v":186},{"$f":"H9/$H$9-1","v":{"v":0,"d":"0%"}},{"$f":"(1091*TAN(RADIANS(A9))/(G9/1.1507))","v":{"v":0,"d":"0.0"}}]
[5,{"v":1.003819838,"d":"1.004"},{"$f":"SQRT(B10)-1","v":{"v":1.9080985799047046E-3,"d":"0.19%"}},{"$f":"( SQRT(B10)*$D$9)","v":{"v":33.062967253136854,"d":"33.1"}},{"$f":"( SQRT(B10)*$E$9)","v":{"v":42.080140140356,"d":"42.1"}},{"$f":"(1/COS(RADIANS(A10)))^1.5","v":{"v":1.005735224521082,"d":"1.01"}},{"$f":"E10*$I$3","v":{"v":46.026761843946296,"d":"46.0"}},{"$f":"F10*$H$9","v":{"v":187.06675176092125,"d":"187"}},{"$f":"H10/$H$9-1","v":{"v":0.005735224521081994,"d":"1%"}},{"$f":"(1091*TAN(RADIANS(A10))/(G10/1.1507))","v":{"v":2.3863174897580017,"d":"2.4"}},{"$f":"360/J10","v":{"v":150.8600601324461,"d":"151"}},{"$f":"H10*(K10/60)","v":{"v":470.3483569905658,"d":"470"}},{"$f":"L10/2","v":{"v":235.1741784952829,"d":"235"}},{"$f":"((E10*$I$5)*360/J10)/PI()/2","v":{"v":1481.8491467384301,"d":"1482"}},{"$f":"N10*2","v":{"v":2963.6982934768603,"d":"2964"}},null,{"$f":"2*PI()*N10","v":{"v":9310.73278624351,"d":"9311"}},{"$f":"$K$7*(COS(RADIANS(A10)))","v":{"v":50.80592960267902,"d":"51"}},{"$f":"2*PI()*(N10+(R10/2))","v":{"v":9470.344321442088,"d":"9470"}},{"$f":"2*PI()*(N10-(R10/2))","v":{"v":9151.121251044935,"d":"9151"}},{"$f":"1-(T10/S10)","v":{"v":0.03370765196724579,"d":"3.4%"}},{"$f":"S10/$K10","v":{"v":62.77568968968786,"d":"62.8"}},{"$f":"T10/$K10","v":{"v":60.65966858962404,"d":"60.7"}},{"$f":"V10-W10","v":{"v":2.1160211000638185,"d":"2.1"}},{"$f":"X10*$I$6","v":{"v":1.4427383801835576,"d":"1.4"}},{"$f":"V10/W10-1","v":{"v":0.03488349259504142,"d":"3.5%"}}]
[10,{"v":1.015426612,"d":"1.02"},{"v":7.683785718515912E-3,"d":"0.77%"},{"v":33.25356492871102,"d":"33.3"},{"$f":"( SQRT(B11)*$E$9)","v":{"v":42.32271900017767,"d":"42.3"}},{"$f":"(1/COS(RADIANS(A11)))^1.5","v":{"v":1.0232289323267876,"d":"1.02"}},{"v":46.29209174475336,"d":"46.3"},{"$f":"F11*$H$9","v":{"v":190.3205814127825,"d":"190"}},{"v":0.023228932326787577,"d":"2%"},{"v":4.781881719270797,"d":"4.8"},{"$f":"360/J11","v":{"v":75.28417077930096,"d":"75"}},{"$f":"H11*(K11/60)","v":{"v":238.80211923159618,"d":"239"}},{"$f":"L11/2","v":{"v":119.40105961579809,"d":"119"}},{"$f":"((E11*$I$5)*360/J11)/PI()/2","v":{"v":743.7547846167007,"d":"744"}},{"$f":"N11*2","v":{"v":1487.5095692334014,"d":"1488"}},null,{"v":4673.149134848171,"d":"4673"},{"$f":"$K$7*(COS(RADIANS(A11)))","v":{"v":50.22519540362261,"d":"50"}},{"$f":"2*PI()*(N11+(R11/2))","v":{"v":4830.936239753304,"d":"4831"}},{"$f":"2*PI()*(N11-(R11/2))","v":{"v":4515.362029943039,"d":"4515"}},{"$f":"1-(T11/S11)","v":{"v":0.06532361309458734,"d":"6.5%"}},{"$f":"S11/$K11","v":{"v":64.16934914399758,"d":"64.2"}},{"$f":"T11/$K11","v":{"v":59.97757540798359,"d":"60.0"}},{"$f":"V11-W11","v":{"v":4.191773736013985,"d":"4.2"}},{"$f":"X11*$I$6","v":{"v":2.8580210517798723,"d":"2.9"}},{"$f":"V11/W11-1","v":{"v":0.06988901614479093,"d":"7.0%"}}]
[15,{"v":1.03527618,"d":"1.04"},{"v":0.017485223479928536,"d":"1.75%"},{"v":33.57701237483764,"d":"33.6"},{"v":42.734379386157,"d":"42.7"},{"v":1.0533782159966267,"d":"1.05"},{"v":46.74236102814594,"d":"46.7"},{"v":195.92834817537258,"d":"196"},{"v":0.05337821599662673,"d":"5%"},{"v":7.196621644324129,"d":"7.2"},{"v":50.02347181665814,"d":"50"},{"v":163.35027005058555,"d":"163"},{"v":81.67513502529278,"d":"82"},{"v":499.00370686748295,"d":"499"},{"v":998.0074137349659,"d":"998"},null,{"v":3135.332759217918,"d":"3135"},{"v":49.262217140742486,"d":"49"},{"v":3290.0945786868197,"d":"3290"},{"v":2980.5709397490164,"d":"2981"},{"v":0.09407742894167614,"d":"9.4%"},{"v":65.77101626903067,"d":"65.8"},{"v":59.58344815955911,"d":"59.6"},{"v":6.187568109471556,"d":"6.2"},{"v":4.218786850124129,"d":"4.2"},{"v":0.10384709681289017,"d":"10.4%"}]
[20,{"v":1.064177772,"d":"1.06"},{"v":0.03158992434009367,"d":"3.16%"},{"v":34.042467503223094,"d":"34.0"},{"v":43.32677682228393,"d":"43.3"},{"v":1.0977950680383084,"d":"1.10"},{"v":47.39031836903487,"d":"47.4"},{"v":204.18988265512536,"d":"204"},{"v":0.0977950680383084,"d":"10%"},{"v":9.641910715429228,"d":"9.6"},{"v":37.3369978861056,"d":"37"},{"v":127.06395361764277,"d":"127"},{"v":63.53197680882138,"d":"64"},{"v":377.61420029721205,"d":"378"},{"v":755.2284005944241,"d":"755"},null,{"v":2372.619995089812,"d":"2373"},{"v":47.92432366008133,"d":"48"},{"v":2523.178698228583,"d":"2523"},{"v":2222.0612919510413,"d":"2222"},{"v":0.11934049954089399,"d":"11.9%"},{"v":67.57851035386929,"d":"67.6"},{"v":59.513657170009054,"d":"59.5"},{"v":8.064853183860237,"d":"8.1"},{"v":5.498751037288713,"d":"5.5"},{"v":0.1355126464640184,"d":"13.6%"}]
[25,{"v":1.103377919,"d":"1.10"},{"v":0.050417973475320954,"d":"5.04%"},{"v":34.66379312468559,"d":"34.7"},{"v":44.11755488596348,"d":"44.1"},{"v":1.1590079975942977,"d":"1.16"},{"v":48.25526210465447,"d":"48.3"},{"v":215.57548755253939,"d":"216"},{"v":0.15900799759429773,"d":"16%"},{"v":12.13150642914519,"d":"12.1"},{"v":29.67479777574221,"d":"30"},{"v":106.61931664214397,"d":"107"},{"v":53.309658321071986,"d":"53"},{"v":305.598869385466,"d":"306"},{"v":611.197738770932,"d":"611"},null,{"v":1920.1343260134533,"d":"1920"},{"v":46.221697138869146,"d":"46"},{"v":2065.344070181377,"d":"2065"},{"v":1774.92458184553,"d":"1775"},{"v":0.14061554804780907,"d":"14.1%"},{"v":69.59926351611742,"d":"69.6"},{"v":59.81252493307468,"d":"59.8"},{"v":9.786738583042741,"d":"9.8"},{"v":6.672761141253821,"d":"6.7"},{"v":0.16362356536516898,"d":"16.4%"}]
[30,{"v":1.154700538,"d":"1.15"},{"v":0.07456993164707515,"d":"7.46%"},{"v":35.46080774435348,"d":"35.5"},{"v":45.13193712917715,"d":"45.1"},{"v":1.2408064788027993,"d":"1.24"},{"v":49.36478145918599,"d":"49.4"},{"v":230.79000505732066,"d":"231"},{"v":0.24080647880279926,"d":"24%"},{"v":14.68280454636689,"d":"14.7"},{"v":24.518476620944895,"d":"25"},{"v":94.31032238909451,"d":"94"},{"v":47.155161194547254,"d":"47"},{"v":258.303325845599,"d":"258"},{"v":516.606651691198,"d":"517"},null,{"v":1622.9676617486887,"d":"1623"},{"v":44.16729559300637,"d":"44"},{"v":1761.723313112606,"d":"1762"},{"v":1484.2120103847708,"d":"1484"},{"v":0.1575226374438614,"d":"15.8%"},{"v":71.85288630891753,"d":"71.9"},{"v":60.534430149582924,"d":"60.5"},{"v":11.318456159334609,"d":"11.3"},{"v":7.717111660656186,"d":"7.7"},{"v":0.18697551346178143,"d":"18.7%"}]
[35,{"v":1.220774589,"d":"1.22"},{"v":0.10488668604522511,"d":"10.49%"},{"v":36.46126063949243,"d":"36.5"},{"v":46.405240813899454,"d":"46.4"},{"v":1.3488175896530858,"d":"1.35"},{"v":50.7575060379601,"d":"50.8"},{"v":250.88007167547397,"d":"251"},{"v":0.34881758965308585,"d":"35%"},{"v":17.31862348899346,"d":"17.3"},{"v":20.78687144095439,"d":"21"},{"v":86.91686328359167,"d":"87"},{"v":43.45843164179583,"d":"43"},{"v":225.16905298984477,"d":"225"},{"v":450.33810597968954,"d":"450"},null,{"v":1414.7788853773343,"d":"1415"},{"v":41.776754258738585,"d":"42"},{"v":1546.0244296474136,"d":"1546"},{"v":1283.533341107255,"d":"1284"},{"v":0.1697845671171072,"d":"17.0%"},{"v":74.37504167180393,"d":"74.4"},{"v":61.74730741723989,"d":"61.7"},{"v":12.62773425456404,"d":"12.6"},{"v":8.609799242204476,"d":"8.6"},{"v":0.20450663814756664,"d":"20.5%"}]
[40,{"v":1.305407289,"d":"1.31"},{"v":0.14254421752508106,"d":"14.25%"},{"v":37.70395917832767,"d":"37.7"},{"v":47.9868571360534,"d":"48.0"},{"v":1.491485550131507,"d":"1.49"},{"v":52.48745934955717,"d":"52.5"},{"v":277.4163123244603,"d":"277"},{"v":0.49148555013150697,"d":"49%"},{"v":20.06988308634512,"d":"20.1"},{"v":17.93732422113271,"d":"18"},{"v":82.9351056399143,"d":"83"},{"v":41.46755281995715,"d":"41"},{"v":200.92431930249225,"d":"201"},{"v":401.8486386049845,"d":"402"},null,{"v":1262.444730896479,"d":"1262"},{"v":39.068266599067876,"d":"39"},{"v":1385.1813102325982,"d":"1385"},{"v":1139.7081515603597,"d":"1140"},{"v":0.1772137386339835,"d":"17.7%"},{"v":77.22340819377388,"d":"77.2"},{"v":63.53835931769701,"d":"63.5"},{"v":13.68504887607687,"d":"13.7"},{"v":9.3306939366571,"d":"9.3"},{"v":0.2153824716758974,"d":"21.5%"}]
[45,{"v":1.414213562,"d":"1.41"},{"v":0.18920711484585384,"d":"18.92%"},{"v":39.24383478991318,"d":"39.2"},{"v":49.946698823525864,"d":"49.9"},{"v":1.6817928305074288,"d":"1.68"},{"v":54.631111112604025,"d":"54.6"},{"v":312.81346647438176,"d":"313"},{"v":0.6817928305074288,"d":"68%"},{"v":22.979830987006256,"d":"23.0"},{"v":15.665911564082384,"d":"16"},{"v":81.67513503069524,"d":"82"},{"v":40.83756751534762,"d":"41"},{"v":182.64803332026491,"d":"183"},{"v":365.29606664052983,"d":"365"},null,{"v":1147.611439343136,"d":"1148"},{"v":36.062445840513924,"d":"36"},{"v":1260.9049542661744,"d":"1261"},{"v":1034.3179244200976,"d":"1034"},{"v":0.17970191098023458,"d":"18.0%"},{"v":80.48717427698762,"d":"80.5"},{"v":66.02347525001376,"d":"66.0"},{"v":14.463699026973856,"d":"14.5"},{"v":9.861590560230901,"d":"9.9"},{"v":0.2190690352515312,"d":"21.9%"}]
[50,{"v":1.555723827,"d":"1.56"},{"v":0.24728658575325024,"d":"24.73%"},{"v":41.16045732985726,"d":"41.2"},{"v":52.38603660163651,"d":"52.4"},{"v":1.9404334602926514,"d":"1.94"},{"v":57.29923005411785,"d":"57.3"},{"v":360.92062361443317,"d":"361"},{"v":0.9404334602926514,"d":"94%"},{"v":26.111062674907068,"d":"26.1"},{"v":13.787259617968854,"d":"14"},{"v":82.93510565419017,"d":"83"},{"v":41.46755282709508,"d":"41"},{"v":168.59552227930897,"d":"169"},{"v":337.19104455861793,"d":"337"},null,{"v":1059.3169084416227,"d":"1059"},{"v":32.78216809401351,"d":"33"},{"v":1162.3051268945212,"d":"1162"},{"v":956.3286899887241,"d":"956"},{"v":0.17721373857838052,"d":"17.7%"},{"v":84.30283893252404,"d":"84.3"},{"v":69.3632176725204,"d":"69.4"},{"v":14.939621260003634,"d":"14.9"},{"v":10.18608225436099,"d":"10.2"},{"v":0.21538247159376311,"d":"21.5%"}]
[55,{"v":1.743446796,"d":"1.74"},{"v":0.32039645410005546,"d":"32.04%"},{"v":43.57308298530183,"d":"43.6"},{"v":55.45665107220233,"d":"55.5"},{"v":2.302040966600051,"d":"2.30"},{"v":60.6578320093373,"d":"60.7"},{"v":428.17961978760945,"d":"428"},{"v":1.302040966600051,"d":"130%"},{"v":29.557874290920125,"d":"29.6"},{"v":12.17949560434352,"d":"12"},{"v":86.91686328454449,"d":"87"},{"v":43.458431642272245,"d":"43"},{"v":157.6650682784878,"d":"158"},{"v":315.3301365569756,"d":"315"},null,{"v":990.6388404628609,"d":"991"},{"v":29.252398253903355,"d":"29"},{"v":1082.5379599172065,"d":"1083"},{"v":898.7397210085151,"d":"899"},{"v":0.1697845671137006,"d":"17.0%"},{"v":88.88200259550533,"d":"88.9"},{"v":73.79121026062865,"d":"73.8"},{"v":15.090792334876681,"d":"15.1"},{"v":10.289153207522265,"d":"10.3"},{"v":0.20450663814262415,"d":"20.5%"}]
{"$rows_left_out":7}
{"sheet":"reference","index":1,"n_rows":29,"n_cols":4,"rows_kept":29}
[null,"ft/sec conversion","inverse ft/sec","kts conversion"]
["mph",1.46667,{"$f":"1/B2","v":0.6818166322349267},0.868976]
["knots",1.688,{"$f":"1/B3","v":0.5924170616113744},1]
["kph",0.911,1.097694840834248,0.539]
[]
[]
[]
["converstion to feet"]
["Feet",1]
["Meters",3.28084]
[]
[]
[]
["g load rescaling array",null,"factor",30]
[{"$f":"'Bank angles'!B9","v":{"v":1,"d":"1.0"}},null,{"$f":"A15*$D$14-($D$14-10)","v":{"v":10,"d":"10.0"}}]
[{"$f":"'Bank angles'!B10","v":{"v":1.003819838,"d":"1.0"}},null,{"$f":"A16*$D$14-($D$14-10)","v":{"v":10.114595140000002,"d":"10.1"}}]
[{"$f":"'Bank angles'!B11","v":{"v":1.015426612,"d":"1.0"}},null,{"v":10.462798359999997,"d":"10.5"}]
[{"$f":"'Bank angles'!B12","v":{"v":1.03527618,"d":"1.0"}},null,{"v":11.058285400000003,"d":"11.1"}]
[{"$f":"'Bank angles'!B13","v":{"v":1.064177772,"d":"1.1"}},null,{"v":11.925333160000001,"d":"11.9"}]
[{"$f":"'Bank angles'!B14","v":{"v":1.103377919,"d":"1.1"}},null,{"v":13.101337569999998,"d":"13.1"}]
{"$rows_left_out":10}
{"sheet":"StdAtm","index":2,"n_rows":142,"n_cols":19,"rows_kept":142}
["1976 Standard Atmosphere up to 20km (65617 ft)"]
[]
[]
[0,0,4,1,2,{"$nulls":4},1,0,3,2,3,{"$nulls":3},"cas",100]
[{"$f":"IF(A4=0,\"ft\",\"meter\")","v":"ft"},{"$f":"IF(B4=0,\"  C\",\"  F\")","v":"  C"},{"$f":"IF(C4=1,\"psi\",IF(C4=2,\"in Hg\",IF(C4=3,\"hPa mB\",IF(C4=4,\"lbs/ft2\",\"atm\"))))","v":"lbs/ft2"},{"$f":"IF(D4=1,\"slugs/ft3\",IF(D4=2,\"kg/m3\",\"SL rho0\"))","v":"slugs/ft3"},{"$f":"IF(E4=1,\"ft/sec\",IF(E4=2,\"knots\",\"m/sec\"))","v":"knots"},null,"tas muliplyer",null,null,{"$f":"IF(J4=0,\"ft\",\"meter\")","v":"meter"},{"$f":"IF(K4=0,\"  C\",\"  F\")","v":"  C"},{"$f":"IF(L4=1,\"psi\",IF(L4=2,\"in Hg\",IF(L4=3,\"hPa mB\",IF(L4=4,\"lbs/ft2\",\"atm\"))))","v":"hPa mB"},{"$f":"IF(M4=1,\"slugs/ft3\",IF(M4=2,\"kg/m3\",\"SL rho0\"))","v":"kg/m3"},{"$f":"IF(N4=1,\"ft/sec\",IF(N4=2,\"knots\",\"m/sec\"))","v":"m/sec"},{"$nulls":3},"alt",15000]
[null,null,{"$f":"IF(C4=1,14.69595,IF(C4=2,29.92126,IF(C4=3,1013.25,IF(C4=4,2116.2166,1))))","v":2116.2166},{"$f":"IF(D4=1,0.002376892,IF(D4=2,1.225,1))","v":0.002376892},{"$f":"IF(E4=1,1.687809,IF(E4=2,1,0.5144442))","v":1},{"$nulls":6},{"$f":"IF(L4=1,14.69595,IF(L4=2,29.92126,IF(L4=3,1013.25,IF(L4=4,2116.2166,1))))","v":1013.25},{"$f":"IF(M4=1,0.002376892,IF(M4=2,1.225,1))","v":1.225},{"$f":"IF(N4=1,1.687809,IF(N4=2,1,0.5144442))","v":0.5144442}]
["Height","Temp","Pressure","Density ","Sound Speed","sigma","inv sigma","sqrt sigma",null,"Height","Temp","Pressure","Density ","Sound Speed",{"$nulls":4},{"$f":"FORECAST(S5,G11:G142,A11:A142)","v":1.249707840796253}]
[1575.42,{"$f":"stdattemp(A8,A$4,B$4)","v":{"v":11.878777895999999,"d":"11.9"}},{"$f":"stdatpress(A8,A$4)*C$6","v":{"v":1998.4820969863006,"d":"1998.4821"}},{"$f":"stdatdens(A8,A$4)*D$6","v":2.2692351779473206E-3},{"$f":"stdatcs(IF(B$4=0,B8,(B8-32)*5/9))*E$6","v":{"v":657.8863032327988,"d":"657.89"}},{"$f":"D8/$D$11","v":0.9547068936860913},{"$f":"SQRT($D$11/D8)","v":1.0234460890578843},{"$f":"SQRT(F8)","v":0.9770910365396314},null,15064,{"$f":"stdattemp(J8,J$4,K$4)","v":-56.5},{"$f":"stdatpress(J8,J$4)*L$6","v":{"v":119.23610530326555,"d":"119.2361"}},{"$f":"stdatdens(J8,J$4)*M$6","v":0.1917287267031398},{"$f":"stdatcs(IF(K$4=0,K8,(K8-32)*5/9))*N$6","v":{"v":295.0693576920398,"d":"295.07"}}]
[11111,{"$f":"stdattemp(A9,A$4,B$4)","v":{"v":-7.013113199999999,"d":"-7.0"}},{"$f":"stdatpress(A9,A$4)*C$6","v":{"v":1393.673500464041,"d":"1393.6735"}},{"$f":"stdatdens(A9,A$4)*D$6","v":1.6948213489444328E-3},{"$f":"stdatcs(IF(B$4=0,B9,(B9-32)*5/9))*E$6","v":{"v":635.7099742831698,"d":"635.71"}},0.7130409580849416,{"$f":"SQRT($D$11/D9)","v":1.1842482768315652},{"$f":"SQRT(F9)","v":0.8444175259224205},null,333,{"$f":"stdattemp(J9,J$4,K$4)","v":{"v":12.8355,"d":"12.8"}},{"$f":"stdatpress(J9,J$4)*L$6","v":{"v":973.8804717841679,"d":"973.8805"}},{"$f":"stdatdens(J9,J$4)*M$6","v":1.1863142399809377},{"$f":"stdatcs(IF(K$4=0,K9,(K9-32)*5/9))*N$6","v":{"v":339.0133274264701,"d":"339.01"}},{"$nulls":3},"tas=",{"$f":"S4*S7","v":124.9707840796253}]
[-500,{"v":15.9906,"d":"16.0"},{"v":2154.734491143442,"d":"2154.7345"},2.4118630366659036E-3,{"v":662.6146419428977,"d":"662.61"},1.0147129262355647,0.9927237305679221,1.0073296015880626,null,-400,17.6,{"v":1062.2343025292912,"d":"1062.2343"},1.2727370848765107,{"v":341.8256326972481,"d":"341.83"}]
[0,{"v":15,"d":"15.0"},2116.2166,0.002376892,{"v":661.478604273801,"d":"661.48"},1,1,1,null,-200,16.3,{"v":1037.5080837154785,"d":"1037.5081"},1.2486940303987344,{"v":341.06059201616415,"d":"341.06"}]
[500,{"v":14.0094,"d":"14.0"},{"v":2078.2581538778722,"d":"2078.2582"},2.3423102125526723E-3,{"v":660.3406121895857,"d":"660.34"},0.9854508377127242,1.0073549352731,0.9926987648389235,null,0,{"v":15,"d":"15.0"},{"v":1013.25,"d":"1013.2500"},1.225,{"v":340.29383139275217,"d":"340.29"}]
[1000,{"v":13.0188,"d":"13.0"},{"v":2040.852915160647,"d":"2040.8529"},0.002308114662122228,{"v":659.2006555684073,"d":"659.20"},0.9710641720878477,1.014789662655268,0.985425883609644,null,200,13.7,{"v":989.4532404822544,"d":"989.4532"},1.2016514674294034,{"v":339.5253391744146,"d":"339.53"}]
[1500,{"v":12.0282,"d":"12.0"},{"v":2003.9946945845272,"d":"2003.9947"},2.274302349528654E-3,{"v":658.0587242007504,"d":"658.06"},0.9568387413179287,1.022305328515441,0.9781813437793264,null,400,12.4,{"v":966.1110632276402,"d":"966.1111"},1.1786449263591154,{"v":338.7551035763796,"d":"338.76"},{"$nulls":4},{"$f":"TREND(G10:G142,A10:A142,S5,1)","v":1.2565135159031913}]
[2000,{"v":11.0376,"d":"11.0"},{"v":1967.677351028942,"d":"1967.6774"},0.00224087028860211,{"v":656.9148077883618,"d":"656.91"},0.9427732890691332,1.029903099753651,0.970965132777245,null,600,11.1,{"v":943.2167948770228,"d":"943.2168"},1.1559768903613439,{"v":337.9831126795926,"d":"337.98"}]
[2500,{"v":10.047,"d":"10.0"},{"v":1931.8947913073434,"d":"1931.8948"},2.2078155061713883E-3,{"v":655.768895943168,"d":"655.77"},0.9288665644763786,1.0375841642419743,0.9637772379945371,null,800,9.8,{"v":920.7638302566598,"d":"920.7638"},1.1336438928852193,{"v":337.20935442856353,"d":"337.21"},{"$nulls":4},{"$f":"VLOOKUP(S5,A11:G142,7)","v":1.2606446516499077}]
[3000,{"v":9.0564,"d":"9.1"},{"v":1896.6409699581911,"d":"1896.6410"},2.1751350420523468E-3,{"v":654.6209781861735,"d":"654.62"},0.9151173221384677,1.0453497312765387,0.9566176467839529,null,1000,8.5,{"v":898.745631988571,"d":"898.7456"},1.111642487233597,{"v":336.4338166291715,"d":"336.43"},{"$nulls":3},"tas",{"$f":"S4*S16","v":126.06446516499076}]
[3500,{"v":8.0658,"d":"8.1"},{"v":1861.9098890361222,"d":"1861.9099"},2.1428259490363097E-3,{"v":653.4710439463432,"d":"653.47"},0.9015243221132091,1.0532010320409004,0.9494863464596051,null,1200,7.2,{"v":877.1557301013743,"d":"877.1557"},1.0899692465397879,{"v":335.6564869464218,"d":"335.66"}]
[4000,{"v":7.0752,"d":"7.1"},{"v":1827.6955979033075,"d":"1827.6956"},0.002110885292878438,{"v":652.319082559467,"d":"652.32"},0.8880863299125237,1.0611393200811203,0.942383324296713,null,1400,5.9,{"v":855.9877216415699,"d":"855.9877"},1.0686207637442005,{"v":334.8773529021571,"d":"334.88"},{"$nulls":4},{"$f":"LINEST(G11:G140,A11:A140,S5)","v":3.8646968233725742E-5}]
[4500,{"v":6.0846,"d":"6.1"},{"v":1793.992193020997,"d":"1793.9922"},0.002079310152286072,{"v":651.1650832670053,"d":"651.17"},0.8748021164975405,1.0691658717928774,0.9353085675313471,null,1600,4.6,{"v":835.2352702852907,"d":"835.2353"},1.047593651570911,{"v":334.09640187272043,"d":"334.10"}]
{"$rows_left_out":122}