{"text_format":"3","workbook":"xlsx","n_sheets":3,"sheets":["Bank angles","reference","StdAtm"],"not_rendered":{"charts":6,"macros":1,"external_links":1,"defined_names":28},"read":"whole","date_system":"1900"}

{"sheet":"Bank angles","index":0,"n_rows":32,"n_cols":26,"rows_kept":32}
[{"$nulls":7},"Bank Angle Performance"]
[]
[{"$nulls":3},"Density Altitude",6000,"ft ",null,null,{"$f":"VLOOKUP(E3,StdAtm!A11:G142,7)","v":1.093788226237521},"tas multiplier"]
["Insert values in green ",null,null,"Min Sink spd",42,"mph","TAS",{"$f":"E4*I3","v":{"v":45.93910550197588,"d":"46"}},{"$f":"VLOOKUP(F4,reference!$A$2:$D$4,4,FALSE)","v":0.868976},{"$f":"F4 &\" conversion to knots\"","v":"mph conversion to knots"},{"$nulls":3},"Note on density altitude effects: Given indicated airspeeds remain valid at any density altitude"]
[{"$nulls":3},"Stall Spd",33,{"$f":"F4","v":"mph"},null,null,{"$f":"VLOOKUP(F4,reference!$A$2:$D$4,2,FALSE)","v":1.46667},{"$f":"$F$4 &\" conversion to f/s \"","v":"mph conversion to f/s "}]
[{"$nulls":3},"Min Sink Rate",186,"ft/min",null,null,{"$f":"VLOOKUP(F4,reference!$A$2:$D$4,3,FALSE)","v":{"v":0.6818166322349267,"d":"0.682"}},{"$f":" \" f/s conversion to \"& $F$4","v":" f/s conversion to mph"}]
[{"$nulls":3},"wingspan",51,"Feet",null,null,{"$f":"VLOOKUP(F7,reference!A9:B10,2,FALSE)","v":1}," ft conversion",{"$f":"VLOOKUP(F7,reference!A9:B10,2,FALSE)*E7","v":{"v":51,"d":"51.0"}},"wingspan ft"]
["Bank angle","G load ","Stall speed\n increase ","Vs",{"$f":"\"V min sink \"& $F$4","v":"V min sink mph"},"sink rate\n factor","min sink \nTAS","Min Sink Rate\n ft/min","% sink rate\n increase","ROT °/sec","time to \nturn 360°: sec","altitude\n loss 360°","altitude\n loss 180°","turn \nradius ft","Turn \nDiameter ft",null,"circle \ncircumference ","effective wing length","outer \ncircumference","inner \ncircumference","wingtip circumference\n D","Outer Tip Speed\n ft/s","Inner Tip Speed\n ft/s","speed D\n f/s",{"$f":"\"Speed delta \n\"&$F$4","v":"Speed delta \nmph"},"Speed Delta %"]
[0,{"v":1,"d":"1.00"},{"v":0,"d":"0.00%"},{"$f":"$E$5","v":{"v":33,"d":"33.0"}},{"$f":"$E$4","v":{"v":42,"d":"42.0"}},{"$f":"(1/COS(RADIANS(A9)))^1.5-1","v":{"v":0,"d":"0.00"}},{"$f":"E9*$I$3","v":{"v":45.93910550197588,"d":"45.9"}},{"$f":"$E$6","v":186},{"$f":"H9/$H$9-1","v":{"v":0,"d":"0%"}},{"$f":"(1091*TAN(RADIANS(A9))/(G9/1.1507))","v":{"v":0,"d":"0.0"}}]
[5,{"v":1.003819838,"d":"1.004"},{"$f":"SQRT(B10)-1","v":{"v":1.9080985799047046E-3,"d":"0.19%"}},{"$f":"( SQRT(B10)*$D$9)","v":{"v":33.062967253136854,"d":"33.1"}},{"$f":"( SQRT(B10)*$E$9)","v":{"v":42.080140140356,"d":"42.1"}},{"$f":"(1/COS(RADIANS(A10)))^1.5","v":{"v":1.005735224521082,"d":"1.01"}},{"$f":"E10*$I$3","v":{"v":46.026761843946296,"d":"46.0"}},{"$f":"F10*$H$9","v":{"v":187.06675176092125,"d":"187"}},{"$f":"H10/$H$9-1","v":{"v":0.005735224521081994,"d":"1%"}},{"$f":"(1091*TAN(RADIANS(A10))/(G10/1.1507))","v":{"v":2.3863174897580017,"d":"2.4"}},{"$f":"360/J10","v":{"v":150.8600601324461,"d":"151"}},{"$f":"H10*(K10/60)","v":{"v":470.3483569905658,"d":"470"}},{"$f":"L10/2","v":{"v":235.1741784952829,"d":"235"}},{"$f":"((E10*$I$5)*360/J10)/PI()/2","v":{"v":1481.8491467384301,"d":"1482"}},{"$f":"N10*2","v":{"v":2963.6982934768603,"d":"2964"}},null,{"$f":"2*PI()*N10","v":{"v":9310.73278624351,"d":"9311"}},{"$f":"$K$7*(COS(RADIANS(A10)))","v":{"v":50.80592960267902,"d":"51"}},{"$f":"2*PI()*(N10+(R10/2))","v":{"v":9470.344321442088,"d":"9470"}},{"$f":"2*PI()*(N10-(R10/2))","v":{"v":9151.121251044935,"d":"9151"}},{"$f":"1-(T10/S10)","v":{"v":0.03370765196724579,"d":"3.4%"}},{"$f":"S10/$K10","v":{"v":62.77568968968786,"d":"62.8"}},{"$f":"T10/$K10","v":{"v":60.65966858962404,"d":"60.7"}},{"$f":"V10-W10","v":{"v":2.1160211000638185,"d":"2.1"}},{"$f":"X10*$I$6","v":{"v":1.4427383801835576,"d":"1.4"}},{"$f":"V10/W10-1","v":{"v":0.03488349259504142,"d":"3.5%"}}]
[10,{"v":1.015426612,"d":"1.02"},{"v":7.683785718515912E-3,"d":"0.77%"},{"v":33.25356492871102,"d":"33.3"},{"$f":"( SQRT(B11)*$E$9)","v":{"v":42.32271900017767,"d":"42.3"}},{"$f":"(1/COS(RADIANS(A11)))^1.5","v":{"v":1.0232289323267876,"d":"1.02"}},{"v":46.29209174475336,"d":"46.3"},{"$f":"F11*$H$9","v":{"v":190.3205814127825,"d":"190"}},{"v":0.023228932326787577,"d":"2%"},{"v":4.781881719270797,"d":"4.8"},{"$f":"360/J11","v":{"v":75.28417077930096,"d":"75"}},{"$f":"H11*(K11/60)","v":{"v":238.80211923159618,"d":"239"}},{"$f":"L11/2","v":{"v":119.40105961579809,"d":"119"}},{"$f":"((E11*$I$5)*360/J11)/PI()/2","v":{"v":743.7547846167007,"d":"744"}},{"$f":"N11*2","v":{"v":1487.5095692334014,"d":"1488"}},null,{"v":4673.149134848171,"d":"4673"},{"$f":"$K$7*(COS(RADIANS(A11)))","v":{"v":50.22519540362261,"d":"50"}},{"$f":"2*PI()*(N11+(R11/2))","v":{"v":4830.936239753304,"d":"4831"}},{"$f":"2*PI()*(N11-(R11/2))","v":{"v":4515.362029943039,"d":"4515"}},{"$f":"1-(T11/S11)","v":{"v":0.06532361309458734,"d":"6.5%"}},{"$f":"S11/$K11","v":{"v":64.16934914399758,"d":"64.2"}},{"$f":"T11/$K11","v":{"v":59.97757540798359,"d":"60.0"}},{"$f":"V11-W11","v":{"v":4.191773736013985,"d":"4.2"}},{"$f":"X11*$I$6","v":{"v":2.8580210517798723,"d":"2.9"}},{"$f":"V11/W11-1","v":{"v":0.06988901614479093,"d":"7.0%"}}]
[15,{"v":1.03527618,"d":"1.04"},{"v":0.017485223479928536,"d":"1.75%"},{"v":33.57701237483764,"d":"33.6"},{"v":42.734379386157,"d":"42.7"},{"v":1.0533782159966267,"d":"1.05"},{"v":46.74236102814594,"d":"46.7"},{"v":195.92834817537258,"d":"196"},{"v":0.05337821599662673,"d":"5%"},{"v":7.196621644324129,"d":"7.2"},{"v":50.02347181665814,"d":"50"},{"v":163.35027005058555,"d":"163"},{"v":81.67513502529278,"d":"82"},{"v":499.00370686748295,"d":"499"},{"v":998.0074137349659,"d":"998"},null,{"v":3135.332759217918,"d":"3135"},{"v":49.262217140742486,"d":"49"},{"v":3290.0945786868197,"d":"3290"},{"v":2980.5709397490164,"d":"2981"},{"v":0.09407742894167614,"d":"9.4%"},{"v":65.77101626903067,"d":"65.8"},{"v":59.58344815955911,"d":"59.6"},{"v":6.187568109471556,"d":"6.2"},{"v":4.218786850124129,"d":"4.2"},{"v":0.10384709681289017,"d":"10.4%"}]
[20,{"v":1.064177772,"d":"1.06"},{"v":0.03158992434009367,"d":"3.16%"},{"v":34.042467503223094,"d":"34.0"},{"v":43.32677682228393,"d":"43.3"},{"v":1.0977950680383084,"d":"1.10"},{"v":47.39031836903487,"d":"47.4"},{"v":204.18988265512536,"d":"204"},{"v":0.0977950680383084,"d":"10%"},{"v":9.641910715429228,"d":"9.6"},{"v":37.3369978861056,"d":"37"},{"v":127.06395361764277,"d":"127"},{"v":63.53197680882138,"d":"64"},{"v":377.61420029721205,"d":"378"},{"v":755.2284005944241,"d":"755"},null,{"v":2372.619995089812,"d":"2373"},{"v":47.92432366008133,"d":"48"},{"v":2523.178698228583,"d":"2523"},{"v":2222.0612919510413,"d":"2222"},{"v":0.11934049954089399,"d":"11.9%"},{"v":67.57851035386929,"d":"67.6"},{"v":59.513657170009054,"d":"59.5"},{"v":8.064853183860237,"d":"8.1"},{"v":5.498751037288713,"d":"5.5"},{"v":0.1355126464640184,"d":"13.6%"}]
[25,{"v":1.103377919,"d":"1.10"},{"v":0.050417973475320954,"d":"5.04%"},{"v":34.66379312468559,"d":"34.7"},{"v":44.11755488596348,"d":"44.1"},{"v":1.1590079975942977,"d":"1.16"},{"v":48.25526210465447,"d":"48.3"},{"v":215.57548755253939,"d":"216"},{"v":0.15900799759429773,"d":"16%"},{"v":12.13150642914519,"d":"12.1"},{"v":29.67479777574221,"d":"30"},{"v":106.61931664214397,"d":"107"},{"v":53.309658321071986,"d":"53"},{"v":305.598869385466,"d":"306"},{"v":611.197738770932,"d":"611"},null,{"v":1920.1343260134533,"d":"1920"},{"v":46.221697138869146,"d":"46"},{"v":2065.344070181377,"d":"2065"},{"v":1774.92458184553,"d":"1775"},{"v":0.14061554804780907,"d":"14.1%"},{"v":69.59926351611742,"d":"69.6"},{"v":59.81252493307468,"d":"59.8"},{"v":9.786738583042741,"d":"9.8"},{"v":6.672761141253821,"d":"6.7"},{"v":0.16362356536516898,"d":"16.4%"}]
[30,{"v":1.154700538,"d":"1.15"},{"v":0.07456993164707515,"d":"7.46%"},{"v":35.46080774435348,"d":"35.5"},{"v":45.13193712917715,"d":"45.1"},{"v":1.2408064788027993,"d":"1.24"},{"v":49.36478145918599,"d":"49.4"},{"v":230.79000505732066,"d":"231"},{"v":0.24080647880279926,"d":"24%"},{"v":14.68280454636689,"d":"14.7"},{"v":24.518476620944895,"d":"25"},{"v":94.31032238909451,"d":"94"},{"v":47.155161194547254,"d":"47"},{"v":258.303325845599,"d":"258"},{"v":516.606651691198,"d":"517"},null,{"v":1622.9676617486887,"d":"1623"},{"v":44.16729559300637,"d":"44"},{"v":1761.723313112606,"d":"1762"},{"v":1484.2120103847708,"d":"1484"},{"v":0.1575226374438614,"d":"15.8%"},{"v":71.85288630891753,"d":"71.9"},{"v":60.534430149582924,"d":"60.5"},{"v":11.318456159334609,"d":"11.3"},{"v":7.717111660656186,"d":"7.7"},{"v":0.18697551346178143,"d":"18.7%"}]
[35,{"v":1.220774589,"d":"1.22"},{"v":0.10488668604522511,"d":"10.49%"},{"v":36.46126063949243,"d":"36.5"},{"v":46.405240813899454,"d":"46.4"},{"v":1.3488175896530858,"d":"1.35"},{"v":50.7575060379601,"d":"50.8"},{"v":250.88007167547397,"d":"251"},{"v":0.34881758965308585,"d":"35%"},{"v":17.31862348899346,"d":"17.3"},{"v":20.78687144095439,"d":"21"},{"v":86.91686328359167,"d":"87"},{"v":43.45843164179583,"d":"43"},{"v":225.16905298984477,"d":"225"},{"v":450.33810597968954,"d":"450"},null,{"v":1414.7788853773343,"d":"1415"},{"v":41.776754258738585,"d":"42"},{"v":1546.0244296474136,"d":"1546"},{"v":1283.533341107255,"d":"1284"},{"v":0.1697845671171072,"d":"17.0%"},{"v":74.37504167180393,"d":"74.4"},{"v":61.74730741723989,"d":"61.7"},{"v":12.62773425456404,"d":"12.6"},{"v":8.609799242204476,"d":"8.6"},{"v":0.20450663814756664,"d":"20.5%"}]
[40,{"v":1.305407289,"d":"1.31"},{"v":0.14254421752508106,"d":"14.25%"},{"v":37.70395917832767,"d":"37.7"},{"v":47.9868571360534,"d":"48.0"},{"v":1.491485550131507,"d":"1.49"},{"v":52.48745934955717,"d":"52.5"},{"v":277.4163123244603,"d":"277"},{"v":0.49148555013150697,"d":"49%"},{"v":20.06988308634512,"d":"20.1"},{"v":17.93732422113271,"d":"18"},{"v":82.9351056399143,"d":"83"},{"v":41.46755281995715,"d":"41"},{"v":200.92431930249225,"d":"201"},{"v":401.8486386049845,"d":"402"},null,{"v":1262.444730896479,"d":"1262"},{"v":39.068266599067876,"d":"39"},{"v":1385.1813102325982,"d":"1385"},{"v":1139.7081515603597,"d":"1140"},{"v":0.1772137386339835,"d":"17.7%"},{"v":77.22340819377388,"d":"77.2"},{"v":63.53835931769701,"d":"63.5"},{"v":13.68504887607687,"d":"13.7"},{"v":9.3306939366571,"d":"9.3"},{"v":0.2153824716758974,"d":"21.5%"}]
[45,{"v":1.414213562,"d":"1.41"},{"v":0.18920711484585384,"d":"18.92%"},{"v":39.24383478991318,"d":"39.2"},{"v":49.946698823525864,"d":"49.9"},{"v":1.6817928305074288,"d":"1.68"},{"v":54.631111112604025,"d":"54.6"},{"v":312.81346647438176,"d":"313"},{"v":0.6817928305074288,"d":"68%"},{"v":22.979830987006256,"d":"23.0"},{"v":15.665911564082384,"d":"16"},{"v":81.67513503069524,"d":"82"},{"v":40.83756751534762,"d":"41"},{"v":182.64803332026491,"d":"183"},{"v":365.29606664052983,"d":"365"},null,{"v":1147.611439343136,"d":"1148"},{"v":36.062445840513924,"d":"36"},{"v":1260.9049542661744,"d":"1261"},{"v":1034.3179244200976,"d":"1034"},{"v":0.17970191098023458,"d":"18.0%"},{"v":80.48717427698762,"d":"80.5"},{"v":66.02347525001376,"d":"66.0"},{"v":14.463699026973856,"d":"14.5"},{"v":9.861590560230901,"d":"9.9"},{"v":0.2190690352515312,"d":"21.9%"}]
[50,{"v":1.555723827,"d":"1.56"},{"v":0.24728658575325024,"d":"24.73%"},{"v":41.16045732985726,"d":"41.2"},{"v":52.38603660163651,"d":"52.4"},{"v":1.9404334602926514,"d":"1.94"},{"v":57.29923005411785,"d":"57.3"},{"v":360.92062361443317,"d":"361"},{"v":0.9404334602926514,"d":"94%"},{"v":26.111062674907068,"d":"26.1"},{"v":13.787259617968854,"d":"14"},{"v":82.93510565419017,"d":"83"},{"v":41.46755282709508,"d":"41"},{"v":168.59552227930897,"d":"169"},{"v":337.19104455861793,"d":"337"},null,{"v":1059.3169084416227,"d":"1059"},{"v":32.78216809401351,"d":"33"},{"v":1162.3051268945212,"d":"1162"},{"v":956.3286899887241,"d":"956"},{"v":0.17721373857838052,"d":"17.7%"},{"v":84.30283893252404,"d":"84.3"},{"v":69.3632176725204,"d":"69.4"},{"v":14.939621260003634,"d":"14.9"},{"v":10.18608225436099,"d":"10.2"},{"v":0.21538247159376311,"d":"21.5%"}]
[55,{"v":1.743446796,"d":"1.74"},{"v":0.32039645410005546,"d":"32.04%"},{"v":43.57308298530183,"d":"43.6"},{"v":55.45665107220233,"d":"55.5"},{"v":2.302040966600051,"d":"2.30"},{"v":60.6578320093373,"d":"60.7"},{"v":428.17961978760945,"d":"428"},{"v":1.302040966600051,"d":"130%"},{"v":29.557874290920125,"d":"29.6"},{"v":12.17949560434352,"d":"12"},{"v":86.91686328454449,"d":"87"},{"v":43.458431642272245,"d":"43"},{"v":157.6650682784878,"d":"158"},{"v":315.3301365569756,"d":"315"},null,{"v":990.6388404628609,"d":"991"},{"v":29.252398253903355,"d":"29"},{"v":1082.5379599172065,"d":"1083"},{"v":898.7397210085151,"d":"899"},{"v":0.1697845671137006,"d":"17.0%"},{"v":88.88200259550533,"d":"88.9"},{"v":73.79121026062865,"d":"73.8"},{"v":15.090792334876681,"d":"15.1"},{"v":10.289153207522265,"d":"10.3"},{"v":0.20450663814262415,"d":"20.5%"}]
[60,{"v":2,"d":"2.00"},{"v":0.41421356237309515,"d":"41.42%"},{"v":46.66904755831214,"d":"46.7"},{"v":59.396969619669996,"d":"59.4"},{"v":2.8284271247461894,"d":"2.83"},{"v":64.96770604418276,"d":"65.0"},{"v":526.0874452027912,"d":"526"},{"v":1.828427124746189,"d":"183%"},{"v":33.46955657383461,"d":"33.5"},{"v":10.756043307769309,"d":"11"},{"v":94.31032240458225,"d":"94"},{"v":47.155161202291126,"d":"47"},{"v":149.1314947585133,"d":"149"},{"v":298.2629895170266,"d":"298"},null,{"v":937.0208167044202,"d":"937"},{"v":25.500000000000007,"d":"26"},{"v":1017.13142937096,"d":"1017"},{"v":856.9102040378805,"d":"857"},{"v":0.1575226373961992,"d":"15.8%"},{"v":94.56371643987946,"d":"94.6"},{"v":79.66779042428333,"d":"79.7"},{"v":14.895926015596132,"d":"14.9"},{"v":10.156290109974385,"d":"10.2"},{"v":0.1869755133946296,"d":"18.7%"}]
[65,{"v":2.366201583,"d":"2.37"},{"v":0.5382462686449137,"d":"53.82%"},{"v":50.76212686528215,"d":"50.8"},{"v":64.60634328308637,"d":"64.6"},{"v":3.639800756263308,"d":"3.64"},{"v":70.66565762329942,"d":"70.7"},{"v":677.0029406649753,"d":"677"},{"v":2.639800756263308,"d":"264%"},{"v":38.098327508733774,"d":"38.1"},{"v":9.449233694509884,"d":"9"},{"v":106.619316636896,"d":"107"},{"v":53.309658318448,"d":"53"},{"v":142.5030931039236,"d":"143"},{"v":285.0061862078472,"d":"285"},null,{"v":895.3733408182173,"d":"895"},{"v":21.55353134877567,"d":"22"},{"v":963.0857565624483,"d":"963"},{"v":827.6609250739864,"d":"828"},{"v":0.14061554806067855,"d":"14.1%"},{"v":101.92210159031335,"d":"101.9"},{"v":87.59026941569527,"d":"87.6"},{"v":14.331832174618071,"d":"14.3"},{"v":9.77168154705426,"d":"9.8"},{"v":0.16362356538259437,"d":"16.4%"}]
[70,{"v":2.9238044,"d":"2.92"},{"v":0.7099135650669597,"d":"70.99%"},{"v":56.42714764720967,"d":"56.4"},{"v":71.8163697328123,"d":"71.8"},{"v":4.999452805580758,"d":"5.00"},{"v":78.55189966487076,"d":"78.6"},{"v":929.8982218380211,"d":"930"},{"v":3.9994528055807583,"d":"400%"},{"v":43.91008756681293,"d":"43.9"},{"v":8.198571671081943,"d":"8"},{"v":127.06395364251121,"d":"127"},{"v":63.531976821255604,"d":"64"},{"v":137.4403289982195,"d":"137"},{"v":274.880657996439,"d":"275"},null,{"v":863.5630557755412,"d":"864"},{"v":17.44302730960911,"d":"17"},{"v":918.3619422277754,"d":"918"},{"v":808.7641693233071,"d":"809"},{"v":0.1193404994969679,"d":"11.9%"},{"v":112.01487028125007,"d":"112.0"},{"v":98.64695971079762,"d":"98.6"},{"v":13.367910570452452,"d":"13.4"},{"v":9.114463765163569,"d":"9.1"},{"v":0.1355126464073808,"d":"13.6%"}]
[null,"cosine bank angle","sqrt gload increase"]
{"$rows_empty":7}
[{"$nulls":8}," "]

{"sheet":"reference","index":1,"n_rows":29,"n_cols":4,"rows_kept":29}
[null,"ft/sec conversion","inverse ft/sec","kts conversion"]
["mph",1.46667,{"$f":"1/B2","v":0.6818166322349267},0.868976]
["knots",1.688,{"$f":"1/B3","v":0.5924170616113744},1]
["kph",0.911,1.097694840834248,0.539]
[]
[]
[]
["converstion to feet"]
["Feet",1]
["Meters",3.28084]
[]
[]
[]
["g load rescaling array",null,"factor",30]
[{"$f":"'Bank angles'!B9","v":{"v":1,"d":"1.0"}},null,{"$f":"A15*$D$14-($D$14-10)","v":{"v":10,"d":"10.0"}}]
[{"$f":"'Bank angles'!B10","v":{"v":1.003819838,"d":"1.0"}},null,{"$f":"A16*$D$14-($D$14-10)","v":{"v":10.114595140000002,"d":"10.1"}}]
[{"$f":"'Bank angles'!B11","v":{"v":1.015426612,"d":"1.0"}},null,{"v":10.462798359999997,"d":"10.5"}]
[{"$f":"'Bank angles'!B12","v":{"v":1.03527618,"d":"1.0"}},null,{"v":11.058285400000003,"d":"11.1"}]
[{"$f":"'Bank angles'!B13","v":{"v":1.064177772,"d":"1.1"}},null,{"v":11.925333160000001,"d":"11.9"}]
[{"$f":"'Bank angles'!B14","v":{"v":1.103377919,"d":"1.1"}},null,{"v":13.101337569999998,"d":"13.1"}]
[{"$f":"'Bank angles'!B15","v":{"v":1.154700538,"d":"1.2"}},null,{"v":14.641016139999998,"d":"14.6"}]
[{"$f":"'Bank angles'!B16","v":{"v":1.220774589,"d":"1.2"}},null,{"v":16.623237669999995,"d":"16.6"}]
[{"$f":"'Bank angles'!B17","v":{"v":1.305407289,"d":"1.3"}},null,{"v":19.162218669999994,"d":"19.2"}]
[{"$f":"'Bank angles'!B18","v":{"v":1.414213562,"d":"1.4"}},null,{"v":22.42640686,"d":"22.4"}]
[{"$f":"'Bank angles'!B19","v":{"v":1.555723827,"d":"1.6"}},null,{"v":26.671714809999997,"d":"26.7"}]
[{"$f":"'Bank angles'!B20","v":{"v":1.743446796,"d":"1.7"}},null,{"v":32.30340388,"d":"32.3"}]
[{"$f":"'Bank angles'!B21","v":{"v":2,"d":"2.0"}},null,{"v":40,"d":"40.0"}]
[{"$f":"'Bank angles'!B22","v":{"v":2.366201583,"d":"2.4"}},null,{"v":50.986047490000004,"d":"51.0"}]
[{"$f":"'Bank angles'!B23","v":{"v":2.9238044,"d":"2.9"}},null,{"v":67.71413199999999,"d":"67.7"}]

{"sheet":"StdAtm","index":2,"n_rows":142,"n_cols":19,"rows_kept":142}
["1976 Standard Atmosphere up to 20km (65617 ft)"]
[]
[]
[0,0,4,1,2,{"$nulls":4},1,0,3,2,3,{"$nulls":3},"cas",100]
[{"$f":"IF(A4=0,\"ft\",\"meter\")","v":"ft"},{"$f":"IF(B4=0,\"  C\",\"  F\")","v":"  C"},{"$f":"IF(C4=1,\"psi\",IF(C4=2,\"in Hg\",IF(C4=3,\"hPa mB\",IF(C4=4,\"lbs/ft2\",\"atm\"))))","v":"lbs/ft2"},{"$f":"IF(D4=1,\"slugs/ft3\",IF(D4=2,\"kg/m3\",\"SL rho0\"))","v":"slugs/ft3"},{"$f":"IF(E4=1,\"ft/sec\",IF(E4=2,\"knots\",\"m/sec\"))","v":"knots"},null,"tas muliplyer",null,null,{"$f":"IF(J4=0,\"ft\",\"meter\")","v":"meter"},{"$f":"IF(K4=0,\"  C\",\"  F\")","v":"  C"},{"$f":"IF(L4=1,\"psi\",IF(L4=2,\"in Hg\",IF(L4=3,\"hPa mB\",IF(L4=4,\"lbs/ft2\",\"atm\"))))","v":"hPa mB"},{"$f":"IF(M4=1,\"slugs/ft3\",IF(M4=2,\"kg/m3\",\"SL rho0\"))","v":"kg/m3"},{"$f":"IF(N4=1,\"ft/sec\",IF(N4=2,\"knots\",\"m/sec\"))","v":"m/sec"},{"$nulls":3},"alt",15000]
[null,null,{"$f":"IF(C4=1,14.69595,IF(C4=2,29.92126,IF(C4=3,1013.25,IF(C4=4,2116.2166,1))))","v":2116.2166},{"$f":"IF(D4=1,0.002376892,IF(D4=2,1.225,1))","v":0.002376892},{"$f":"IF(E4=1,1.687809,IF(E4=2,1,0.5144442))","v":1},{"$nulls":6},{"$f":"IF(L4=1,14.69595,IF(L4=2,29.92126,IF(L4=3,1013.25,IF(L4=4,2116.2166,1))))","v":1013.25},{"$f":"IF(M4=1,0.002376892,IF(M4=2,1.225,1))","v":1.225},{"$f":"IF(N4=1,1.687809,IF(N4=2,1,0.5144442))","v":0.5144442}]
["Height","Temp","Pressure","Density ","Sound Speed","sigma","inv sigma","sqrt sigma",null,"Height","Temp","Pressure","Density ","Sound Speed",{"$nulls":4},{"$f":"FORECAST(S5,G11:G142,A11:A142)","v":1.249707840796253}]
[1575.42,{"$f":"stdattemp(A8,A$4,B$4)","v":{"v":11.878777895999999,"d":"11.9"}},{"$f":"stdatpress(A8,A$4)*C$6","v":{"v":1998.4820969863006,"d":"1998.4821"}},{"$f":"stdatdens(A8,A$4)*D$6","v":2.2692351779473206E-3},{"$f":"stdatcs(IF(B$4=0,B8,(B8-32)*5/9))*E$6","v":{"v":657.8863032327988,"d":"657.89"}},{"$f":"D8/$D$11","v":0.9547068936860913},{"$f":"SQRT($D$11/D8)","v":1.0234460890578843},{"$f":"SQRT(F8)","v":0.9770910365396314},null,15064,{"$f":"stdattemp(J8,J$4,K$4)","v":-56.5},{"$f":"stdatpress(J8,J$4)*L$6","v":{"v":119.23610530326555,"d":"119.2361"}},{"$f":"stdatdens(J8,J$4)*M$6","v":0.1917287267031398},{"$f":"stdatcs(IF(K$4=0,K8,(K8-32)*5/9))*N$6","v":{"v":295.0693576920398,"d":"295.07"}}]
[11111,{"$f":"stdattemp(A9,A$4,B$4)","v":{"v":-7.013113199999999,"d":"-7.0"}},{"$f":"stdatpress(A9,A$4)*C$6","v":{"v":1393.673500464041,"d":"1393.6735"}},{"$f":"stdatdens(A9,A$4)*D$6","v":1.6948213489444328E-3},{"$f":"stdatcs(IF(B$4=0,B9,(B9-32)*5/9))*E$6","v":{"v":635.7099742831698,"d":"635.71"}},0.7130409580849416,{"$f":"SQRT($D$11/D9)","v":1.1842482768315652},{"$f":"SQRT(F9)","v":0.8444175259224205},null,333,{"$f":"stdattemp(J9,J$4,K$4)","v":{"v":12.8355,"d":"12.8"}},{"$f":"stdatpress(J9,J$4)*L$6","v":{"v":973.8804717841679,"d":"973.8805"}},{"$f":"stdatdens(J9,J$4)*M$6","v":1.1863142399809377},{"$f":"stdatcs(IF(K$4=0,K9,(K9-32)*5/9))*N$6","v":{"v":339.0133274264701,"d":"339.01"}},{"$nulls":3},"tas=",{"$f":"S4*S7","v":124.9707840796253}]
[-500,{"v":15.9906,"d":"16.0"},{"v":2154.734491143442,"d":"2154.7345"},2.4118630366659036E-3,{"v":662.6146419428977,"d":"662.61"},1.0147129262355647,0.9927237305679221,1.0073296015880626,null,-400,17.6,{"v":1062.2343025292912,"d":"1062.2343"},1.2727370848765107,{"v":341.8256326972481,"d":"341.83"}]
[0,{"v":15,"d":"15.0"},2116.2166,0.002376892,{"v":661.478604273801,"d":"661.48"},1,1,1,null,-200,16.3,{"v":1037.5080837154785,"d":"1037.5081"},1.2486940303987344,{"v":341.06059201616415,"d":"341.06"}]
[500,{"v":14.0094,"d":"14.0"},{"v":2078.2581538778722,"d":"2078.2582"},2.3423102125526723E-3,{"v":660.3406121895857,"d":"660.34"},0.9854508377127242,1.0073549352731,0.9926987648389235,null,0,{"v":15,"d":"15.0"},{"v":1013.25,"d":"1013.2500"},1.225,{"v":340.29383139275217,"d":"340.29"}]
[1000,{"v":13.0188,"d":"13.0"},{"v":2040.852915160647,"d":"2040.8529"},0.002308114662122228,{"v":659.2006555684073,"d":"659.20"},0.9710641720878477,1.014789662655268,0.985425883609644,null,200,13.7,{"v":989.4532404822544,"d":"989.4532"},1.2016514674294034,{"v":339.5253391744146,"d":"339.53"}]
[1500,{"v":12.0282,"d":"12.0"},{"v":2003.9946945845272,"d":"2003.9947"},2.274302349528654E-3,{"v":658.0587242007504,"d":"658.06"},0.9568387413179287,1.022305328515441,0.9781813437793264,null,400,12.4,{"v":966.1110632276402,"d":"966.1111"},1.1786449263591154,{"v":338.7551035763796,"d":"338.76"},{"$nulls":4},{"$f":"TREND(G10:G142,A10:A142,S5,1)","v":1.2565135159031913}]
[2000,{"v":11.0376,"d":"11.0"},{"v":1967.677351028942,"d":"1967.6774"},0.00224087028860211,{"v":656.9148077883618,"d":"656.91"},0.9427732890691332,1.029903099753651,0.970965132777245,null,600,11.1,{"v":943.2167948770228,"d":"943.2168"},1.1559768903613439,{"v":337.9831126795926,"d":"337.98"}]
[2500,{"v":10.047,"d":"10.0"},{"v":1931.8947913073434,"d":"1931.8948"},2.2078155061713883E-3,{"v":655.768895943168,"d":"655.77"},0.9288665644763786,1.0375841642419743,0.9637772379945371,null,800,9.8,{"v":920.7638302566598,"d":"920.7638"},1.1336438928852193,{"v":337.20935442856353,"d":"337.21"},{"$nulls":4},{"$f":"VLOOKUP(S5,A11:G142,7)","v":1.2606446516499077}]
[3000,{"v":9.0564,"d":"9.1"},{"v":1896.6409699581911,"d":"1896.6410"},2.1751350420523468E-3,{"v":654.6209781861735,"d":"654.62"},0.9151173221384677,1.0453497312765387,0.9566176467839529,null,1000,8.5,{"v":898.745631988571,"d":"898.7456"},1.111642487233597,{"v":336.4338166291715,"d":"336.43"},{"$nulls":3},"tas",{"$f":"S4*S16","v":126.06446516499076}]
[3500,{"v":8.0658,"d":"8.1"},{"v":1861.9098890361222,"d":"1861.9099"},2.1428259490363097E-3,{"v":653.4710439463432,"d":"653.47"},0.9015243221132091,1.0532010320409004,0.9494863464596051,null,1200,7.2,{"v":877.1557301013743,"d":"877.1557"},1.0899692465397879,{"v":335.6564869464218,"d":"335.66"}]
[4000,{"v":7.0752,"d":"7.1"},{"v":1827.6955979033075,"d":"1827.6956"},0.002110885292878438,{"v":652.319082559467,"d":"652.32"},0.8880863299125237,1.0611393200811203,0.942383324296713,null,1400,5.9,{"v":855.9877216415699,"d":"855.9877"},1.0686207637442005,{"v":334.8773529021571,"d":"334.88"},{"$nulls":4},{"$f":"LINEST(G11:G140,A11:A140,S5)","v":3.8646968233725742E-5}]
[4500,{"v":6.0846,"d":"6.1"},{"v":1793.992193020997,"d":"1793.9922"},0.002079310152286072,{"v":651.1650832670053,"d":"651.17"},0.8748021164975405,1.0691658717928774,0.9353085675313471,null,1600,4.6,{"v":835.2352702852907,"d":"835.2353"},1.047593651570911,{"v":334.09640187272043,"d":"334.10"}]
[5000,{"v":5.094000000000001,"d":"5.1"},{"v":1760.7938177412502,"d":"1760.7938"},0.002048097618907039,{"v":650.0090352149168,"d":"650.01"},0.861670458273678,1.077281986920968,0.9282620633601688,null,1800,{"v":3.3000000000000007,"d":"3.3"},{"v":814.8921059505083,"d":"814.8921"},1.0268845425041477,{"v":333.3136210865688,"d":"333.31"}]
[5500,{"v":4.103400000000001,"d":"4.1"},{"v":1728.0946620988584,"d":"1728.0947"},2.0172447973179357E-3,{"v":648.8509274524682,"d":"648.85"},0.8486901370857135,1.0854889890715524,0.9212437989401684,null,2000,{"v":2,"d":"2.0"},{"v":794.9520244097009,"d":"794.9520"},1.0064900887646921,{"v":332.52899762183625,"d":"332.53"}]
[6000,{"v":3.1128,"d":"3.1"},{"v":1695.8889626034493,"d":"1695.8890"},1.9867488050123727E-3,{"v":647.6907489310228,"d":"647.69"},0.8358599402128379,1.093788226237521,0.9142537613884003,null,2200,{"v":0.7000000000000011,"d":"0.7"},{"$f":"stdatpress(J23,J$4)*L$6","v":{"v":775.4088869029904,"d":"775.4089"}},{"$f":"stdatdens(J23,J$4)*M$6","v":0.9864069622862048},{"v":331.7425184038453,"d":"331.74"}]
[6500,{"v":2.1221999999999994,"d":"2.1"},{"v":1664.1710020317914,"d":"1664.1710"},1.9566067723891956E-3,{"v":646.5284885028118,"d":"646.53"},0.8231786603637,1.1021810713373594,0.9072919377817154,null,2400,{"v":-0.5999999999999996,"d":"-0.6"},{"v":756.2566197517359,"d":"756.2566"},0.9666318546914595,{"v":330.9541702025645,"d":"330.95"}]
[7000,{"v":1.1316000000000006,"d":"1.1"},{"v":1632.9351092202787,"d":"1632.9351"},1.926815842740669E-3,{"v":645.3641349196835,"d":"645.36"},0.8106450956714353,1.1106689227679207,0.900358315156491,null,2600,{"v":-1.8999999999999986,"d":"-1.9"},{"v":737.4892139726038,"d":"737.4892"},0.9471614772685013,{"v":330.16393963001246,"d":"330.16"}]
[7500,{"v":0.14100000000000001,"d":"0.1"},{"v":1602.1756588576095,"d":"1602.1757"},1.897373172240631E-3,{"v":644.1976768318345,"d":"644.20"},0.7982580496886822,1.1192532049715018,0.893452880508358,null,2800,{"v":-3.1999999999999993,"d":"-3.2"},{"v":719.1007248920965,"d":"719.1007"},0.9279925609467137,{"v":329.3718131376044,"d":"329.37"}]
[8000,{"v":-0.8496000000000006,"d":"-0.8"},{"v":1571.8870712776554,"d":"1571.8871"},1.868275929932615E-3,{"v":643.0291027865175,"d":"643.03"},0.786016331382585,1.1279353690176606,0.8865756207919238,null,3000,-4.5,{"v":701.0852717615609,"d":"701.0853"},0.9091218562728066,{"v":328.5777770134423,"d":"328.58"}]
[8500,{"v":-1.8401999999999994,"d":"-1.8"},{"v":1542.0638122525236,"d":"1542.0638"},1.8395212977179417E-3,{"v":641.8584012267307,"d":"641.86"},0.7739187551297837,1.1367168932002008,0.8797265229204947,null,3200,{"v":-5.800000000000001,"d":"-5.8"},{"v":683.4370373726614,"d":"683.4370"},0.8905461333867152,{"v":327.78181737954566,"d":"327.78"}]
[9000,{"v":-2.8308,"d":"-2.8"},{"v":1512.7003927858066,"d":"1512.7004"},1.8111064703437763E-3,{"v":640.6855604898833,"d":"640.69"},0.7619641407113897,1.1455992836497875,0.8729055737657938,null,3400,{"v":-7.099999999999998,"d":"-7.1"},{"v":666.150267673329,"d":"666.1503"},0.8722621819974099,{"v":326.9839201890213,"d":"326.98"}]
[9500,{"v":-3.8214000000000006,"d":"-3.8"},{"v":1483.7913689060297,"d":"1483.7914"},0.001783028655391155,{"v":639.5105688064406,"d":"639.51"},0.750151313307948,1.1545840749626524,0.866112760157676,null,3600,{"v":-8.399999999999999,"d":"-8.4"},{"v":649.2192713841881,"d":"649.2193"},0.854266811358627,{"v":326.18407122317103,"d":"326.18"}]
[10000,{"v":-4.811999999999998,"d":"-4.8"},{"v":1455.3313414602876,"d":"1455.3313"},0.001755285073262979,{"v":638.3334142985451,"d":"638.33"},0.7384791034943864,1.1636728308458808,0.8593480688838409,null,3800,-9.7,{"v":632.6384196154546,"d":"632.6384"},0.8365568502445015,{"v":325.3822560885353,"d":"325.38"}]
[10500,{"v":-5.802599999999998,"d":"-5.8"},{"v":1427.3149559080746,"d":"1427.3150"},0.001727872957171973,{"v":637.1540849786176,"d":"637.15"},0.7269463472349493,1.1728671447797736,0.852611486689541,null,4000,{"v":-11,"d":"-11.0"},{"v":616.4021454843197,"d":"616.4021"},0.8191291469251194,{"v":324.57846021387127,"d":"324.58"}]
[11000,{"v":-6.793199999999999,"d":"-6.8"},{"v":1399.7369021153115,"d":"1399.7369"},1.7007895531286161E-3,{"v":635.9725687479298,"d":"635.97"},0.7155518858781199,1.1821686406978071,0.8459030002772894,null,4200,{"v":-12.299999999999997,"d":"-12.3"},{"v":600.5049437328081,"d":"600.5049"},0.8019805691419761,{"v":323.77266884706313,"d":"323.77"}]
[11500,{"v":-7.783799999999999,"d":"-7.8"},{"v":1372.5919141485635,"d":"1372.5919"},1.6740321199290337E-3,{"v":634.7888533951597,"d":"634.79"},0.7042945661515264,1.191578973684721,0.8392225963065618,null,4400,{"v":-13.599999999999998,"d":"-13.6"},{"v":584.9413703461208,"d":"584.9414"},0.7851080040833438,{"v":322.96486705196355,"d":"322.96"}]
[12000,{"v":-8.7744,"d":"-8.8"},{"v":1345.8747700694562,"d":"1345.8748"},1.6475979291428594E-3,{"v":633.6029265949161,"d":"633.60"},0.6931732401568349,1.201099830693294,0.8325702613934964,null,4600,{"v":-14.899999999999999,"d":"-14.9"},{"v":569.706042171464,"d":"569.7060"},0.7685083583595529,{"v":322.15503970516266,"d":"322.16"}]
[12500,{"v":-9.765,"d":"-9.8"},{"v":1319.580291729284,"d":"1319.5803"},1.6214842651010625E-3,{"v":632.4147759062432,"d":"632.41"},0.6821867653646285,1.2107329312803703,0.8259459821105909,null,4800,-16.2,{"v":554.7936365373585,"d":"554.7936"},0.7521785579781746,{"v":321.34317149268526,"d":"321.34"}]
[13000,{"v":-10.755600000000001,"d":"-10.8"},{"v":1293.7033445638183,"d":"1293.7033"},1.5956884248837413E-3,{"v":631.2243887710969,"d":"631.22"},0.6713340046092718,1.2204800283627397,0.8193497449863958,null,5000,-17.5,{"v":540.1988908734428,"d":"540.1989"},0.7361155483191172,{"v":320.5292469066119,"d":"320.53"}]
[13500,{"v":-11.746199999999998,"d":"-11.7"},{"v":1268.2388373883084,"d":"1268.2388"},1.5702077183078823E-3,{"v":630.0317525127969,"d":"630.03"},0.6606138260837608,1.2303429089934756,0.8127815365052043,null,5200,{"v":-18.799999999999997,"d":"-18.8"},{"v":525.9166023307616,"d":"525.9166"},0.7203162941096257,{"v":319.71325024162235,"d":"319.71"}]
[14000,{"v":-12.736799999999999,"d":"-12.7"},{"v":1243.1817221926829,"d":"1243.1817"},1.5450394679150867E-3,{"v":628.8368543344507,"d":"628.84"},0.6500251033345591,1.2403233951593682,0.8062413431067394,null,5400,-20.1,{"v":511.9416274025454,"d":"511.9416"},0.7047777793991855,{"v":318.89516559145994,"d":"318.90"}]
[14500,{"v":-13.7274,"d":"-13.7"},{"v":1218.5269939369477,"d":"1218.5270"},1.5201810089592596E-3,{"v":627.6396813173529,"d":"627.64"},0.6395667152564187,1.250423344600109,0.7997291511858367,null,5600,-21.4,{"v":498.2688815454869,"d":"498.2689"},0.6894970075343366,{"v":318.0749768453141,"d":"318.07"}]
[15000,{"v":-14.718,"d":"-14.7"},{"v":1194.2696903467784,"d":"1194.2697"},1.4956296893942646E-3,{"v":626.4402204193544,"d":"626.44"},0.6292375460871864,1.2606446516499077,0.7932449470921239,null,5800,{"v":-22.699999999999996,"d":"-22.7"},{"v":484.8933388015071,"d":"484.8933"},0.674471001133384,{"v":317.25266768411825,"d":"317.25"}]
[15500,{"v":-15.7086,"d":"-15.7"},{"v":1170.4048917093214,"d":"1170.4049"},0.001471382869861548,{"v":625.2384584732057,"d":"625.24"},0.6190364854025964,1.2709892481022385,0.7867887171296982,null,6000,{"v":-24,"d":"-24.0"},{"v":471.8100314200243,"d":"471.8100"},0.6596968020610199,{"v":316.4282215767613,"d":"316.43"}]
[16000,{"v":-16.6992,"d":"-16.7"},{"v":1146.9277206691834,"d":"1146.9277"},1.4474379236777224E-3,{"v":624.0343821848693,"d":"624.03"},0.608962428111047,1.2814591040984493,0.7803604475567986,null,6200,{"v":-25.299999999999997,"d":"-25.3"},{"v":459.0140494807152,"d":"459.0140"},0.6451714714028401,{"v":315.60162177621083,"d":"315.60"}]
[16500,{"v":-17.689799999999998,"d":"-17.7"},{"v":1123.833342024628,"d":"1123.8333"},1.4237922368221172E-3,{"v":622.8279781318055,"d":"622.83"},0.5990142744483625,1.292056229040987,0.773960124585474,null,6400,-26.6,{"v":446.50054051678353,"d":"446.5005"},0.6308920894397685,{"v":314.7728513155428,"d":"314.77"}]
[17000,{"v":-18.6804,"d":"-18.7"},{"v":1101.11696252397,"d":"1101.1170"},1.4004432079242927E-3,{"v":621.6192327612249,"d":"621.62"},0.589190929972541,1.3027826725320153,0.7675877343812504,null,6600,-27.9,{"v":434.2647091387252,"d":"434.2647"},0.616855755622376,{"v":313.94189300387944,"d":"313.94"}]
[17500,{"v":-19.671,"d":"-19.7"},{"v":1078.7738306621704,"d":"1078.7738"},1.3773882482515194E-3,{"v":620.4081323883133,"d":"620.41"},0.5794913055584854,1.3136405253382393,0.7612432630627909,null,6800,{"v":-29.199999999999996,"d":"-29.2"},{"v":422.30181665860283,"d":"422.3018"},0.6030595885451052,{"v":313.10872942222755,"d":"313.11"}]
[18000,{"v":-20.6616,"d":"-20.7"},{"v":1056.799236477637,"d":"1056.7992"},1.3546247816962193E-3,{"v":619.1946631944239,"d":"619.19"},0.569914317392721,1.3246319203827683,0.7549266967015547,null,7000,-30.5,{"v":410.6071807148246,"d":"410.6072"},0.5895007259203886,{"v":312.27334291921903,"d":"312.27"}]
[18500,{"v":-21.6522,"d":"-21.7"},{"v":1035.1885113492206,"d":"1035.1885"},1.3321502447633728E-3,{"v":617.9788112252371,"d":"617.98"},0.5604588869680965,1.3357590337648904,0.7486380213214505,null,7200,{"v":-31.799999999999997,"d":"-31.8"},{"v":399.17617489743037,"d":"399.1762"},0.5761763245526663,{"v":311.435715606747,"d":"311.44"}]
[19000,{"v":-22.6428,"d":"-22.6"},{"v":1013.9370277934219,"d":"1013.9370"},1.309962086557888E-3,{"v":616.7605623888887,"d":"616.76"},0.5511239410784706,1.3470240858086506,0.7423772228984875,null,7400,{"v":-33.099999999999994,"d":"-33.1"},{"v":388.00422837389254,"d":"388.0042"},0.5630835603123029,{"v":310.595829355497,"d":"310.60"}]
[19500,{"v":-23.6334,"d":"-23.6"},{"v":993.0401992617951,"d":"993.0402"},1.2880577687719318E-3,{"v":615.5399024540646,"d":"615.54"},0.5419084118133815,1.3584293421411748,0.7361442873604206,null,7600,-34.4,{"v":377.0868255154247,"d":"377.0868"},0.550219628109395,{"v":309.7536657903688,"d":"309.75"}]
[20000,{"v":-24.623999999999995,"d":"-24.6"},{"v":972.4934799385603,"d":"972.4935"},1.2664347656722262E-3,{"v":614.3168170480608,"d":"614.32"},0.5328112365527026,1.3699771148016917,0.729939200586393,null,7800,{"v":-35.699999999999996,"d":"-35.7"},{"v":366.41950552380916,"d":"366.4195"},0.537581741867479,{"v":308.9092062857854,"d":"308.91"}]
[20500,{"v":-25.614600000000003,"d":"-25.6"},{"v":952.2923645384174,"d":"952.2924"},1.2450905640873059E-3,{"v":613.0912916548086,"d":"613.09"},0.5238313579612813,1.381669763382266,0.7237619484065747,null,8000,{"v":-37,"d":"-37.0"},{"v":355.9978620587388,"d":"355.9979"},0.5251671344971294,{"v":308.0624319608874,"d":"308.06"}]
[21000,{"v":-26.605199999999996,"d":"-26.6"},{"v":932.4323881045672,"d":"932.4324"},1.2240226633947369E-3,{"v":611.8633116128657,"d":"611.86"},0.5149677239835622,1.3935096962012745,0.7176125166017955,null,8200,-38.3,{"v":345.8175428656772,"d":"345.8175"},0.5129730578694494,{"v":307.2133236746069,"d":"307.21"}]
[21500,{"v":-27.595800000000004,"d":"-27.6"},{"v":912.9091258069384,"d":"912.9091"},1.2032285755083014E-3,{"v":610.6328621133683,"d":"610.63"},0.5062192878381944,1.4054993715106985,0.7114908909031755,null,8400,{"v":-39.599999999999994,"d":"-39.6"},{"v":335.874249404243,"d":"335.8742"},0.5009967827894575,{"v":306.3618620206197,"d":"306.36"}]
[22000,{"v":-28.586399999999998,"d":"-28.6"},{"v":893.7181927406194,"d":"893.7182"},1.1827058248651383E-3,{"v":609.3999281979486,"d":"609.40"},0.4975850080126225,1.4176412987383575,0.7053970569917503,null,8600,-40.9,{"v":326.1637364771136,"d":"326.1637"},0.48923559896935875,{"v":305.5080273221698,"d":"305.51"}]
[22500,{"v":-29.576999999999998,"d":"-29.6"},{"v":874.8552437244995,"d":"874.8552"},1.1624519484128505E-3,{"v":608.1644947566128,"d":"608.16"},0.48906384825766197,1.4299380397662333,0.6993310004980917,null,8800,{"v":-42.199999999999996,"d":"-42.2"},{"v":316.6818118594567,"d":"316.6818"},0.47768681500171145,{"v":304.6517996267642,"d":"304.65"}]
[23000,{"v":-30.5676,"d":"-30.6"},{"v":856.3159731001157,"d":"856.3160"},0.001142464495596571,{"v":606.9265465255802,"d":"606.93"},0.4806547775820572,1.4423922102460875,0.6932927070019251,null,9000,-43.5,{"v":307.4243359288883,"d":"307.4243"},0.4663477583324789,{"v":303.79315870073265,"d":"303.79"}]
[23500,{"v":-31.5582,"d":"-31.6"},{"v":838.0961145307097,"d":"838.0961"},0.001122741028345991,{"v":605.6860680850834,"d":"605.69"},0.4723567702470247,1.4550064809536205,0.6872821620317413,null,9200,-44.8,{"v":298.3872212959598,"d":"298.3872"},0.45521577523396906,{"v":302.93208402364877,"d":"302.93"}]
[24000,{"v":-32.5488,"d":"-32.5"},{"v":820.1914408004925,"d":"820.1914"},1.1032791210623459E-3,{"v":604.4430438571276,"d":"604.44"},0.4641688057607775,1.4677835791824634,0.6812993510644036,null,9400,{"v":-46.099999999999994,"d":"-46.1"},{"v":289.5664324351779,"d":"289.5664"},0.444288230777662,{"v":302.068554782608,"d":"302.07"}]
[24500,{"v":-33.5394,"d":"-33.5"},{"v":802.5977636141199,"d":"802.5978"},1.0840763606053668E-3,{"v":603.1974581032074,"d":"603.20"},0.4560898688730354,1.4807262901793412,0.6753442595247519,null,9600,-47.4,{"v":280.95798531655856,"d":"280.9580"},0.4335625088069224,{"v":301.20254986635797,"d":"301.20"}]
[25000,{"v":-34.53,"d":"-34.5"},{"v":785.3109333963766,"d":"785.3109"},1.0651303462801873E-3,{"v":601.9492949219824,"d":"601.95"},0.4481189495695166,1.4938374586218062,0.6694168727852,null,9800,{"v":-48.699999999999996,"d":"-48.7"},{"v":272.5579470377168,"d":"272.5579"},0.42303601190959506,{"v":300.3340478592767,"d":"300.33"}]
[25500,{"v":-35.5206,"d":"-35.5"},{"v":768.3268390920737,"d":"768.3268"},1.0464386898242127E-3,{"v":600.6985382469087,"d":"600.70"},0.4402550430664131,1.5071199901399814,0.6635171761653297,null,10000,{"v":-50,"d":"-50.0"},{"v":264.36243545649467,"d":"264.3624"},0.41270616139048333,{"v":299.46302703519297,"d":"299.46"}]
[26000,{"v":-36.5112,"d":"-36.5"},{"v":751.6414079661553,"d":"751.6414"},1.027999015393948E-3,{"v":599.4451718438258,"d":"599.45"},0.4324971498048494,1.5205768528838184,0.6576451549314792,null,10200,-51.3,{"v":256.36761882413157,"d":"256.3676"},0.40257039724371174,{"v":298.5894653510454,"d":"298.59"}]
[26500,{"v":-37.5018,"d":"-37.5"},{"v":735.2506054040172,"d":"735.2506"},1.009808959551784E-3,{"v":598.1891793084985,"d":"598.19"},0.42484427544532277,1.5342110791374273,0.651800794296327,null,10400,{"v":-52.599999999999994,"d":"-52.6"},{"v":248.56971541897641,"d":"248.5697"},0.392626178124966,{"v":297.71334044037326,"d":"297.71"}]
[27000,{"v":-38.492399999999996,"d":"-38.5"},{"v":719.1504347120424,"d":"719.1504"},9.9186617125274581E-4,{"v":596.9305440641116,"d":"596.93"},0.41729543086212834,1.5480257669820954,0.6459840794184701,null,10600,{"v":-53.89999999999999,"d":"-53.9"},{"v":240.96499318074663,"d":"240.9650"},0.382870981323615,{"v":296.8346296066348,"d":"296.83"}]
[27500,{"v":-39.483,"d":"-39.5"},{"v":703.3369369183456,"d":"703.3369"},9.7416831183119636E-4,{"v":595.6692493587169,"d":"595.67"},0.409849632137765,1.562024082009683,0.6401949954019985,null,10800,-55.2,{"v":233.54976934533434,"d":"233.5498"},0.37330230273471,{"v":295.9533098163467,"d":"295.95"}]
[28000,{"v":-40.4736,"d":"-40.5"},{"v":687.8061905737338,"d":"687.8062"},9.5671305498750032E-4,{"v":594.4052782626333,"d":"594.41"},0.4025059005573246,1.5762092590881351,0.6344335272960632,null,11000,-56.5,{"v":226.3204100801624,"d":"226.3204"},0.36391765683085925,{"v":295.0693576920398,"d":"295.07"}]
[28500,{"v":-41.464200000000005,"d":"-41.5"},{"v":672.5543115528818,"d":"672.5543"},9.3949808677464409E-4,{"v":593.1386136657935,"d":"593.14"},0.395263262602863,1.5905846041809328,0.6286996600944389,null,11200,-56.5,{"v":219.29416233454086,"d":"219.2942"},0.3526196231493455,{"v":295.0693576920398,"d":"295.07"}]
[29000,{"v":-42.4548,"d":"-42.5"},{"v":657.5774528557232,"d":"657.5775"},9.2252110558481665E-4,{"v":591.8692382750438,"d":"591.87"},0.3881207499477539,1.6051534962223624,0.6229933787350824,null,11400,-56.5,{"v":212.48604850519035,"d":"212.4860"},0.3416723434438278,{"v":295.0693576920398,"d":"295.07"}]
[29500,{"v":-43.4454,"d":"-43.4"},{"v":642.8718044090576,"d":"642.8718"},9.0577982213594429E-4,{"v":590.5971346113879,"d":"590.60"},0.3810773994510244,1.6199193890505743,0.6173146680996852,null,11600,-56.5,{"v":205.8892964987902,"d":"205.8893"},0.3310649283546933,{"v":295.0693576920398,"d":"295.07"}]
[30000,{"v":-44.436,"d":"-44.4"},{"v":628.4335928683744,"d":"628.4336"},8.8927195945818539E-4,{"v":589.3222850071792,"d":"589.32"},0.37413225315167264,1.6348858134004602,0.6116635130132193,null,11800,-56.5,{"v":199.49734446556513,"d":"199.4973"},0.32078682658878277,{"v":295.0693576920398,"d":"295.07"}]
[30500,{"v":-45.42659999999999,"d":"-45.4"},{"v":614.259081419895,"d":"614.2591"},8.7299525288038026E-4,{"v":588.0446716032584,"d":"588.04"},0.36728435826296707,1.6500563789584775,0.6060398982434796,null,12000,-56.5,{"v":193.30383427215318,"d":"193.3038"},0.3108278144239224,{"v":295.0693576920398,"d":"295.07"}]
[31000,{"$f":"stdattemp(A73,A$4,B$4)","v":{"v":-46.4172,"d":"-46.4"}},{"$f":"stdatpress(A73,A$4)*C$6","v":{"v":600.3445695828326,"d":"600.3446"}},{"$f":"stdatdens(A73,A$4)*D$6","v":8.5694745001645785E-4},{"$f":"stdatcs(IF(B$4=0,B73,(B73-32)*5/9))*E$6","v":{"v":586.7642763460342,"d":"586.76"}},{"$f":"D73/$D$11","v":0.3605327671667278},{"$f":"SQRT($D$11/D73)","v":1.6654347764816189},{"$f":"SQRT(F73)","v":0.6004438085006188},null,12200,{"$f":"stdattemp(J73,J$4,K$4)","v":-56.5},{"v":187.30260517711204,"d":"187.3026"},0.30117798553929376,{"$f":"stdatcs(IF(K$4=0,K73,(K73-32)*5/9))*N$6","v":{"v":295.0693576920398,"d":"295.07"}}]
[31500,{"v":-47.4078,"d":"-47.4"},{"v":586.6863930118711,"d":"586.6864"},8.4112631075179873E-4,{"v":585.4810809845065,"d":"585.48"},0.3538765374075889,1.6810247799828282,0.5948752284366772,null,12400,-56.5,{"v":181.48768770277294,"d":"181.4877"},0.29182774116152527,{"v":295.0693576920398,"d":"295.07"}]
[32000,{"v":-48.3984,"d":"-48.4"},{"v":573.2809232998643,"d":"573.2809"},8.2552960722955351E-4,{"v":584.1950670672317,"d":"584.20"},0.34731473168724264,1.6968302489852418,0.5893341426451064,null,12600,-56.5,{"v":175.85329769734656,"d":"175.8533"},0.2827677805167044,{"v":295.0693576920398,"d":"295.07"}]
[32500,{"v":-49.388999999999996,"d":"-49.4"},{"v":560.1245677807548,"d":"560.1246"},8.1015512383691719E-4,{"v":582.9062159392267,"d":"582.91"},0.3408464178586647,1.712855130847742,0.5838205356602872,null,12800,-56.5,{"v":170.3938305813739,"d":"170.3938"},0.27398909157881246,{"v":295.0693576920398,"d":"295.07"}]
[33000,{"v":-50.379599999999996,"d":"-50.4"},{"v":547.2137693327153,"d":"547.2138"},7.9500065719135919E-4,{"v":581.614508738812,"d":"581.61"},0.33447066892032085,1.7291034631644036,0.5783343919570414,null,13000,-56.5,{"v":165.1038557727999,"d":"165.1039"},0.2654829421053794,{"v":295.0693576920398,"d":"295.07"}]
[33500,{"v":-51.3702,"d":"-51.4"},{"v":534.5450061815088,"d":"534.5450"},7.8006401612680466E-4,{"v":580.3199263943904,"d":"580.32"},0.3281865630103533,1.7455793762405318,0.5728756959501365,null,13200,-56.5,{"v":159.9781112851235,"d":"159.9781"},0.25724087095144244,{"v":295.0693576920398,"d":"295.07"}]
[34000,{"v":-52.3608,"d":"-52.4"},{"v":522.1147917040763,"d":"522.1148"},7.6534302167977639E-4,{"v":579.0224496211627,"d":"579.02"},0.3219931834007504,1.7622870956480736,0.567444431993786,null,13400,-56.5,{"v":155.0114984932513,"d":"155.0115"},0.2492546796531671,{"v":295.0693576920398,"d":"295.07"}]
[34500,{"v":-53.3514,"d":"-53.4"},{"v":509.9196742323434,"d":"509.9197"},7.5083550707548462E-4,{"v":577.7220589177748,"d":"577.72"},0.3158896184914942,1.7792309448633385,0.5620405843811408,null,13600,-56.5,{"v":150.19907706184864,"d":"150.1991"},0.2415164242727604,{"v":295.0693576920398,"d":"295.07"}]
[35000,{"v":-54.342,"d":"-54.3"},{"v":497.95623685725326,"d":"497.9562"},7.3653931771387445E-4,{"v":576.4187345628992,"d":"576.42"},0.30987496180469054,1.7964153479900486,0.5566641373437762,null,13800,-56.5,{"v":145.53606003114226,"d":"145.5361"},0.23401840749656244,{"v":295.0693576920398,"d":"295.07"}]
[35500,{"v":-55.3326,"d":"-55.3"},{"v":486.22109723302344,"d":"486.2211"},7.2245231115562519E-4,{"v":575.112456611744,"d":"575.11"},0.30394831197867855,1.8138448325708914,0.5513150750511712,null,14000,-56.5,{"v":141.0178090552879,"d":"141.0178"},0.22675317097845846,{"v":295.0693576920398,"d":"295.07"}]
[36000,{"v":-56.3232,"d":"-56.3"},{"v":474.71090738162945,"d":"474.7109"},7.0857235710810207E-4,{"v":573.803204892493,"d":"573.80"},0.2981087727621205,1.8315240324908613,0.5459933816101807,null,14200,-56.5,{"v":136.63982978856487,"d":"136.6398"},0.21971348792099313,{"v":295.0693576920398,"d":"295.07"}]
[36500,-56.5,{"v":463.43958058501966,"d":"463.4396"},6.9231283706024473E-4,{"v":573.5692183759478,"d":"573.57"},0.29126810854689433,1.8529066168606272,0.5396926056070199,null,14400,-56.5,{"v":132.39776741480918,"d":"132.3978"},0.21289235588680888,{"v":295.0693576920398,"d":"295.07"}]
[37000,-56.5,{"v":452.435083868386,"d":"452.4351"},6.7587368369165333E-4,{"v":573.5692183759478,"d":"573.57"},0.2843518694545875,1.8753051922621065,0.5332465372176246,null,14600,-56.5,{"v":128.28740231563793,"d":"128.2874"},0.20628298983325707,{"v":295.0693576920398,"d":"295.07"}]
[37500,-56.5,{"v":441.69189186774895,"d":"441.6919"},6.5982488241392247E-4,{"v":573.5692183759478,"d":"573.57"},0.27759985830821193,1.8979745293822015,0.5268774604290944,null,14800,-56.5,{"v":124.30464587315612,"d":"124.3046"},0.19987881536325403,{"v":295.0693576920398,"d":"295.07"}]
[38000,-56.5,{"v":431.20379983278156,"d":"431.2038"},6.441571642123151E-4,{"v":573.5692183759478,"d":"573.57"},0.2710081754712941,1.9209179012821207,0.5205844556566149,null,15000,-56.5,{"$f":"stdatpress(J87,J$4)*L$6","v":{"v":120.44553640297096,"d":"120.4455"}},{"$f":"stdatdens(J87,J$4)*M$6","v":0.19367346218566775},{"v":295.0693576920398,"d":"295.07"}]
[38500,-56.5,{"v":420.9647503466117,"d":"420.9648"},6.2886148016732645E-4,{"v":573.5692183759478,"d":"573.57"},0.2645730139052706,1.944138620588967,0.5143666142988584,null,15200,-56.5,{"v":116.70623521346799,"d":"116.7062"},0.18766075777873084,{"v":295.0693576920398,"d":"295.07"}]
[39000,-56.5,{"v":410.9688298273501,"d":"410.9688"},6.1392899622846444E-4,{"v":573.5692183759478,"d":"573.57"},0.2582906569707267,1.9676400399740248,0.5082230386067977,null,15400,-56.5,{"v":113.08302278742934,"d":"113.0830"},0.18183472125017644,{"v":295.0693576920398,"d":"295.07"}]
[39500,-56.5,{"v":401.2102651126899,"d":"401.2103"},5.99351088112127E-4,{"v":573.5692183759478,"d":"573.57"},0.2521574762808437,1.991425552636827,0.5021528415540867,null,15600,-56.5,{"v":109.57229508219581,"d":"109.5723"},0.17618955738798991,{"v":295.0693576920398,"d":"295.07"}]
[40000,-56.5,{"v":391.68342012560674,"d":"391.6834"},5.8511933632063166E-4,{"v":573.5692183759478,"d":"573.57"},0.2461699296058179,2.0154985927950744,0.4961551467089885,null,15800,-56.5,{"v":106.17055994469246,"d":"106.1706"},0.17071965089585805,{"v":295.0693576920398,"d":"295.07"}]
[40500,-56.5,{"v":382.3827926192314,"d":"382.3828"},5.7122552127951854E-4,{"v":573.5692183759478,"d":"573.57"},0.2403245588270391,2.0398626361804792,0.49022908810783467,null,16000,-56.5,{"v":102.87443363775202,"d":"102.8744"},0.16541956080758258,{"v":295.0693576920398,"d":"295.07"}]
[41000,-56.5,{"v":373.3030109990173,"d":"373.3030"},5.5766161859032066E-4,{"v":573.5692183759478,"d":"573.57"},0.23461798793984778,2.064521200540599,0.4843738101299943,null,16200,-56.5,{"v":99.68063747428042,"d":"99.6806"},0.16028401507490075,{"v":295.0693576920398,"d":"295.07"}]
[41500,-56.5,{"v":364.4388312203665,"d":"364.4388"},5.4441979439605781E-4,{"v":573.5692183759478,"d":"573.57"},0.22904692110371774,2.089477846146738,0.47858846737433797,null,16400,-56.5,{"v":96.58599455591653,"d":"96.5860"},0.15530790532333086,{"v":295.0693576920398,"d":"295.07"}]
[42000,-56.5,{"v":355.7851337599214,"d":"355.7851"},5.3149240085677686E-4,{"v":573.5692183759478,"d":"573.57"},0.2236081407387365,2.1147361763079924,0.47287222453717503,null,16600,-56.5,{"v":93.58742661294247,"d":"93.5874"},0.15048628177082518,{"v":295.0693576920398,"d":"295.07"}]
[42500,-56.5,{"v":347.336920658775,"d":"347.3369"},5.1887197173252947E-4,{"v":573.5692183759478,"d":"573.57"},0.21829850566728717,2.140299837891502,0.4672242562916519,null,16800,-56.5,{"v":90.68195094230013,"d":"90.6820"},0.14581434830417622,{"v":295.0693576920398,"d":"295.07"}]
[43000,-56.5,{"v":339.0893126358906,"d":"339.0893"},5.0655121807123018E-4,{"v":573.5692183759478,"d":"573.57"},0.2131149492998547,2.1661725218489973,0.46164374716858747,null,17000,-56.5,{"v":87.86667744066933,"d":"87.8667"},0.14128745770827902,{"v":295.0693576920398,"d":"295.07"}]
[43500,-56.5,{"v":331.03754627006407,"d":"331.0375"},4.9452302399890927E-4,{"v":573.5692183759478,"d":"573.57"},0.2080544778639119,2.1923579637497084,0.4561298914387347,null,17200,-56.5,{"v":85.13880572965535,"d":"85.1388"},0.13690110704350347,{"v":295.0693576920398,"d":"295.07"}]
[44000,-56.5,{"v":323.17697124880067,"d":"323.1770"},4.8278044260992618E-4,{"v":573.5692183759478,"d":"573.57"},0.20311416867486037,2.2188599443197177,0.4506818929964464,null,17400,-56.5,{"v":82.49562237022694,"d":"82.4956"},0.13265093316657914,{"v":295.0693576920398,"d":"295.07"}]
[44500,-56.5,{"v":315.503047682519,"d":"315.5030"},0.000471316691954772,{"v":573.5692183759478,"d":"573.57"},0.1982911684480288,2.2456822899878293,0.4452989652447317,null,17600,-56.5,{"v":79.93449816363353,"d":"79.9345"},0.12853270839053643,{"v":295.0693576920398,"d":"295.07"}]
[45000,-56.5,{"v":308.01134348252947,"d":"308.0113"},4.6012515112314154E-4,{"v":573.5692183759478,"d":"573.57"},0.19358269165075298,2.2728288734380424,0.4399803309816849,null,17800,-56.5,{"v":77.45288553611714,"d":"77.4529"},0.12454233627938767,{"v":295.0693576920398,"d":"295.07"}]
[45500,-56.5,{"v":300.69753180127276,"d":"300.6975"},4.4919935642001455E-4,{"v":573.5692183759478,"d":"573.57"},0.1889860188935865,2.300303614168698,0.4347252222882708,null,18000,-56.5,{"v":75.04831600481737,"d":"75.0483"},0.12067584757336444,{"v":295.0693576920398,"d":"295.07"}]
[46000,-56.5,{"v":293.55738853334157,"d":"293.5574"},4.385329976325368E-4,{"v":573.5692183759478,"d":"573.57"},0.1844984953597121,2.3281104790583864,0.4295328804174508,null,18200,-56.5,{"v":72.71839772234887,"d":"72.7184"},0.1169293962406588,{"v":295.0693576920398,"d":"295.07"}]
[46500,-56.5,{"v":286.5867898758407,"d":"286.5868"},4.2811991438554495E-4,{"v":573.5692183759478,"d":"573.57"},0.1801175292716476,2.3562534829386976,0.4244025556846325,null,18400,-56.5,{"v":70.46081309760872,"d":"70.4608"},0.1132992556517397,{"v":295.0693576920398,"d":"295.07"}]
[47000,-56.5,{"v":279.78170994667676,"d":"279.7817"},4.1795409258363065E-4,{"v":573.5692183759478,"d":"573.57"},0.1758405903943598,2.3847366891738937,0.4193335073594284,null,18600,-56.5,{"v":68.27331649044731,"d":"68.2733"},0.1097818148724407,{"v":295.0693576920398,"d":"295.07"}]
[47500,-56.5,{"v":273.1382184594028,"d":"273.1382"},4.0802966093768839E-4,{"v":573.5692183759478,"d":"573.57"},0.17166520857392276,2.4135642102475874,0.4143250035587072,null,18800,-56.5,{"v":66.15373197790953,"d":"66.1537"},0.10637357507213054,{"v":295.0693576920398,"d":"295.07"}]
[48000,-56.5,{"v":266.65247845327434,"d":"266.6525"},3.9834088757394193E-4,{"v":573.5692183759478,"d":"573.57"},0.1675889723108757,2.4427402083565135,0.4093763211409225,null,19000,-56.5,{"v":64.09995118982417,"d":"64.1000"},0.1030711460433941,{"v":295.0693576920398,"d":"295.07"}]
[48500,-56.5,{"v":260.320744077205,"d":"260.3207"},3.8888217672349007E-4,{"v":573.5692183759478,"d":"573.57"},0.1636095273674572,2.4722688960114803,0.4044867456017035,null,19200,-56.5,{"v":62.10993121158877,"d":"62.1099"},0.09987124282976212,{"v":295.0693576920398,"d":"295.07"}]
[49000,-56.5,{"v":254.1393584263441,"d":"254.1394"},3.7964806549045969E-4,{"v":573.5692183759478,"d":"573.57"},0.1597245754079107,2.5021545366455817,0.3996555709706931,null,19400,-56.5,{"v":60.181692552063716,"d":"60.1817"},0.09677068245813462,{"v":295.0693576920398,"d":"295.07"}]
[49500,-56.5,{"v":248.10475143002384,"d":"248.1048"},3.7063322069690052E-4,{"v":573.5692183759478,"d":"573.57"},0.15593187267107658,2.532401445229764,0.39488209970961785,null,19600,-56.5,{"v":58.31331717455423,"d":"58.3133"},0.09376638077264857,{"v":295.0693576920398,"d":"295.07"}]
[50000,-56.5,{"v":242.21343778985877,"d":"242.2134"},3.6183243580259836E-4,{"v":573.5692183759478,"d":"573.57"},0.15222922867450367,2.5630139888958325,0.3901656426115755,null,19800,-56.5,{"v":56.50294658892167,"d":"56.5029"},0.09085534936683963,{"v":295.0693576920398,"d":"295.07"}]
[50500,-56.5,{"v":236.46201496680516,"d":"236.4620"},3.5324062789802768E-4,{"v":573.5692183759478,"d":"573.57"},0.14861450494933204,2.5939965875669926,0.3855055187015253,null,20000,-56.5,{"v":54.74878000292632,"d":"54.7488"},0.08803469261104678,{"v":295.0693576920398,"d":"295.07"}]
[51000,-56.5,{"v":230.84716121601852,"d":"230.8472"},3.4485283476870879E-4,{"v":573.5692183759478,"d":"573.57"},0.14508561380521656,2.625353714596007,0.38090105513796696]
[51500,-56.5,{"v":225.3656336683734,"d":"225.3656"},3.366642120292708E-4,{"v":573.5692183759478,"d":"573.57"},0.14164051712457731,2.6570898974110717,0.3763515871157943]
[52000,-56.5,{"v":220.0142664575386,"d":"220.0143"},3.2867003032556859E-4,{"v":573.5692183759478,"d":"573.57"},0.13827722518548113,2.689209718169501,0.37185645777030835]
[52500,-56.5,{"v":214.7899688915253,"d":"214.7900"},3.208656726032353E-4,{"v":573.5692183759478,"d":"573.57"},0.13499379551247398,2.7217178144193084,0.36741501808237775]
[53000,-56.5,{"v":209.6897236676519,"d":"209.6897"},3.1324663144109395E-4,{"v":573.5692183759478,"d":"573.57"},0.13178833175470067,2.7546188797687914,0.3630266267847314]
[53500,-56.5,{"v":204.71058512989555,"d":"204.7106"},3.0580850644788848E-4,{"v":573.5692183759478,"d":"573.57"},0.128658982590664,2.787917664564205,0.3586906502693707]
[54000,-56.5,{"v":199.8496775676231,"d":"199.8497"},2.9854700172082934E-4,{"v":573.5692183759478,"d":"573.57"},0.12560394065899055,2.821618976575632,0.3544064624960873]
[54500,-56.5,{"v":195.10419355471893,"d":"195.1042"},2.9145792336448683E-4,{"v":573.5692183759478,"d":"573.57"},0.12262144151458579,2.855727681691141,0.3501734449020739]
[55000,-56.5,{"v":190.4713923281511,"d":"190.4714"},2.8453717706859949E-4,{"v":573.5692183759478,"d":"573.57"},0.11970976260957567,2.8902487046193364,0.3459909863126143]
[55500,-56.5,{"v":185.94859820503828,"d":"185.9486"},2.7778076574339723E-4,{"v":573.5692183759478,"d":"573.57"},0.11686722229844572,2.9251870296004023,0.3418584828528403]
[56000,-56.5,{"v":181.5331990373045,"d":"181.5332"},2.7118478721107497E-4,{"v":573.5692183759478,"d":"573.57"},0.11409217886680378,2.96054770112574,0.3377753378605427]
[56500,-56.5,{"v":177.22264470302804,"d":"177.2226"},2.6474543195208276E-4,{"v":573.5692183759478,"d":"573.57"},0.11138302958320478,2.9963358246663065,0.33374096180002355]
[57000,-56.5,{"v":173.0144456336138,"d":"173.0144"},2.5845898090493062E-4,{"v":573.5692183759478,"d":"573.57"},0.10873820977349019,3.032556567409755,0.3297547721769773]
[57500,-56.5,{"v":168.9061713759384,"d":"168.9062"},2.5232180331823752E-4,{"v":573.5692183759478,"d":"573.57"},0.10615619191710753,3.069215159006489,0.3258161934543885]
[58000,-56.5,{"v":164.8954491886377,"d":"164.8954"},2.4633035465378486E-4,{"v":573.5692183759478,"d":"573.57"},0.1036354847648883,3.106316892324731,0.32192465696943484]
[58500,-56.5,{"v":160.97996267172527,"d":"160.9800"},2.4048117453936109E-4,{"v":573.5692183759478,"d":"573.57"},0.10117463247777396,3.143867124214727,0.31807960085138115]
[59000,-56.5,{"v":157.15745042875156,"d":"157.1575"},2.3477088477021795E-4,{"v":573.5692183759478,"d":"573.57"},0.09877221378599363,3.1818712762821773,0.3142804699404556]
[59500,-56.5,{"v":153.42570476073035,"d":"153.4257"},2.2919618735798192E-4,{"v":573.5692183759478,"d":"573.57"},0.09642684116820703,3.220334835671025,0.310526715707694]
[60000,-56.5,{"v":149.7825703910778,"d":"149.7826"},2.2375386262589496E-4,{"v":573.5692183759478,"d":"573.57"},0.094137160050139,3.259263355855706,0.30681779617574173]
[60500,-56.5,{"v":146.22594322082858,"d":"146.2259"},2.1844076734928413E-4,{"v":573.5692183759478,"d":"573.57"},0.09190184802224255,3.298662457442974,0.3031531758406013]
[61000,-56.5,{"v":142.7537691134099,"d":"142.7538"},2.1325383294018663E-4,{"v":573.5692183759478,"d":"573.57"},0.08971961407593894,3.3385378289834184,0.29953232559431536]
[61500,-56.5,{"v":139.36404270827086,"d":"139.3640"},2.0819006367508105E-4,{"v":573.5692183759478,"d":"573.57"},0.08758919785799316,3.378895227792795,0.295954722648572]
[62000,-56.5,{"v":136.05480626268286,"d":"136.0548"},2.0324653496470179E-4,{"v":573.5692183759478,"d":"573.57"},0.0855093689425947,3.419740480783279,0.2924198504592236]
[62500,-56.5,{"v":132.8241485210417,"d":"132.8241"},1.9842039166493691E-4,{"v":573.5692183759478,"d":"573.57"},0.08347892612072275,3.4610794853047775,0.28892719865170663]
[63000,{"$f":"stdattemp(A137,A$4,B$4)","v":-56.5},{"$f":"stdatpress(A137,A$4)*C$6","v":{"v":129.67020361101837,"d":"129.6702"}},{"$f":"stdatdens(A137,A$4)*D$6","v":1.9370884642783471E-4},{"$f":"stdatcs(IF(B$4=0,B137,(B137-32)*5/9))*E$6","v":{"v":573.5692183759478,"d":"573.57"}},{"$f":"D137/$D$11","v":0.08149669670638579},{"$f":"SQRT($D$11/D137)","v":3.502918209996398},{"$f":"SQRT(F137)","v":0.28547626294735223}]
[63500,-56.5,{"v":126.59114996592106,"d":"126.5911"},1.8910917809176578E-4,{"v":573.5692183759478,"d":"573.57"},0.0795615358593347,3.5452626956482183,0.2820665450905773]
[64000,-56.5,{"v":123.58520927264595,"d":"123.5852"},1.8461873010981066E-4,{"v":573.5692183759478,"d":"573.57"},0.07767232592385799,3.588119056073478,0.2786975527769449]
[64500,-56.5,{"v":120.65064544460917,"d":"120.6506"},1.8023490901546672E-4,{"v":573.5692183759478,"d":"573.57"},0.0758279757832778,3.6314934789913025,0.2753687995820837]
[65000,-56.5,{"v":117.78576361906696,"d":"117.7858"},1.7595518292478677E-4,{"v":573.5692183759478,"d":"573.57"},0.0740274202297735,3.675392226920101,0.27207980489145733]
[65500,-56.5,{"v":114.98890917824426,"d":"114.9889"},1.7177708007408456E-4,{"v":573.5692183759478,"d":"573.57"},0.07226961934916883,3.719821638081772,0.2688300938309713]